WOOD IN THE ROUGH (ROUNDWOOD)
type: Concept
definition: All roundwood felled or otherwise harvested and removed. It comprises all wood obtained from removals, i.e. the quantities removed from forests and from trees outside the forest, including wood recovered from natural, felling and logging losses during the period, calendar year or forest year. It includes all wood removed with or without bark, including wood removed in its round form, or split, roughly squared or in other form (e.g. branches, roots, stumps and burls, where these are harvested) and wood that is roughly shaped or pointed. It is an aggregate comprising wood fuel, including wood for charcoal and industrial roundwood (wood in the rough). Coniferous All woods derived from trees classified botanically as Gymnospermae, e.g. Abies spp., Araucaria spp., Cedrus spp., Chamaecyparis spp., Cupressus spp., Larix spp., Picea spp., Pinus spp., Thuja spp., Tsuga spp., etc. These are generally referred to as softwoods. Non-coniferous All woods derived from trees classified botanically as Angiospermae, e.g. Acer spp., Dipterocarpus spp., Entandrophragma spp., Eucalyptus spp., Fagus spp., Populus spp., Quercus spp., Shorea spp., Swietenia spp., Tectona spp., etc. These are generally referred to as broadleaves or hardwoods. Non-coniferous tropical Tropical timber is defined in the International Tropical Timber Agreement (1994) as follows: “Non-coniferous tropical wood for industrial uses, which grows or is produced in the countries situated between the Tropic of Cancer and the Tropic of Capricorn. The term covers logs, sawnwood, veneer sheets and plywood. Plywood which includes in some measure conifers of tropical origin shall also be covered by the definition.” Non-Coniferous other All woods derived from trees classified botanically as Angiospermae, e.g. Acer spp., Eucalyptus spp., Fagus spp., Populus spp., Quercus spp., etc. other than tropical.
in scheme: Forest Products Classification and Definitions (FPC&D) v2022
narrower: WOOD FUEL (INCLUDING WOOD FOR CHARCOAL)
narrower: WOOD IN THE ROUGH OTHER THAN WOOD FUEL
notation: 01
top concept of: Forest Products Classification and Definitions (FPC&D) v2022

WOOD FUEL (INCLUDING WOOD FOR CHARCOAL)
type: Concept
broader: WOOD IN THE ROUGH (ROUNDWOOD)
definition: Roundwood that will be used as fuel for purposes such as cooking, heating or power production. It includes wood harvested from main stems, branches and other parts of trees (where these are harvested for fuel) and wood that will be used for the production of charcoal (e.g. in pit kilns and portable ovens), wood pellets and other agglomerates. It also includes wood chips to be used for fuel that are made directly (i.e. in the forest) from roundwood. It excludes wood charcoal, pellets and other agglomerates.
in scheme: Forest Products Classification and Definitions (FPC&D) v2022
narrower: Wood fuel from the main stem and branches
narrower: Other wood fuel (tops, small branches and twigs; stumps and roots; bark)
notation: 011.

Wood fuel from the main stem and branches
type: Concept
broader: WOOD FUEL (INCLUDING WOOD FOR CHARCOAL)
definition: Roundwood that will be used as fuel for purposes such as cooking, heating or power production. It includes wood harvested from main stems, branches and other parts of trees (where these are harvested for fuel) and wood that will be used for the production of charcoal (e.g. in pit kilns and portable ovens), wood pellets and other agglomerates. It also includes wood chips to be used for fuel that are made directly (i.e. in the forest) from roundwood. It excludes wood charcoal, pellets and other agglomerates.
in scheme: Forest Products Classification and Definitions (FPC&D) v2022
narrower: Wood fuel from the main stem and branches, coniferous
narrower: Wood fuel from the main stem and branches, tropical non-coniferous
narrower: Other wood fuel from the main stem and branches
notation: 011.1

Wood fuel from the main stem and branches, coniferous
type: Concept
broader: Wood fuel from the main stem and branches
definition: It includes wood from main stem and branches where these are harvested for fuel. It also includes wood chips to be used for fuel that are made directly (i.e. in the forest) from roundwood.
in scheme: Forest Products Classification and Definitions (FPC&D) v2022
narrower: Wood fuel, coniferous, for pellets
narrower: Wood fuel, coniferous, for uses n.e.c.
notation: 011.11

Wood fuel, coniferous, for pellets
type: Concept
broader: Wood fuel from the main stem and branches, coniferous
definition: N.A.
in scheme: Forest Products Classification and Definitions (FPC&D) v2022
notation: 011.111

Wood fuel, coniferous, for uses n.e.c.
type: Concept
broader: Wood fuel from the main stem and branches, coniferous
definition: N.A.
in scheme: Forest Products Classification and Definitions (FPC&D) v2022
notation: 011.119

Wood fuel from the main stem and branches, tropical non-coniferous
type: Concept
broader: Wood fuel from the main stem and branches
definition: It includes wood from main stem and branches where these are harvested for fuel. It also includes wood chips to be used for fuel that are made directly (i.e. in the forest) from roundwood.
in scheme: Forest Products Classification and Definitions (FPC&D) v2022
narrower: Wood fuel, tropical non-coniferous, for pellets
narrower: Wood fuel, tropical non-coniferous, for uses n.e.c.
notation: 011.12

Wood fuel, tropical non-coniferous, for pellets
type: Concept
broader: Wood fuel from the main stem and branches, tropical non-coniferous
definition: N.A.
in scheme: Forest Products Classification and Definitions (FPC&D) v2022
notation: 011.121

Wood fuel, tropical non-coniferous, for uses n.e.c.
type: Concept
broader: Wood fuel from the main stem and branches, tropical non-coniferous
definition: N.A.
in scheme: Forest Products Classification and Definitions (FPC&D) v2022
notation: 011.129

Other wood fuel from the main stem and branches
type: Concept
broader: Wood fuel from the main stem and branches
definition: It includes wood from main stem and branches where these are harvested for fuel. It also includes wood chips to be used for fuel that are made directly (i.e. in the forest) from roundwood.
in scheme: Forest Products Classification and Definitions (FPC&D) v2022
narrower: Other wood fuel from main stem and branches, for pellets
narrower: Other wood fuel from main stem and branches, for uses n.e.c.
notation: 011.19

Other wood fuel from main stem and branches, for pellets
type: Concept
broader: Other wood fuel from the main stem and branches
definition: N.A.
in scheme: Forest Products Classification and Definitions (FPC&D) v2022
notation: 011.191

Other wood fuel from main stem and branches, for uses n.e.c.
type: Concept
broader: Other wood fuel from the main stem and branches
definition: N.A.
in scheme: Forest Products Classification and Definitions (FPC&D) v2022
notation: 011.199

Other wood fuel (tops, small branches and twigs; stumps and roots; bark)
type: Concept
broader: WOOD FUEL (INCLUDING WOOD FOR CHARCOAL)
definition: Roundwood that will be used as fuel for purposes such as cooking, heating or power production. It includes wood harvested from main stems, branches and other parts of trees (where these are harvested for fuel) and wood that will be used for the production of charcoal (e.g. in pit kilns and portable ovens), wood pellets and other agglomerates. It also includes wood chips to be used for fuel that are made directly (i.e. in the forest) from roundwood. It excludes wood charcoal, pellets and other agglomerates.
in scheme: Forest Products Classification and Definitions (FPC&D) v2022
narrower: Stumps and roots
narrower: Bark separated in the forest from wood in the rough
narrower: Tops, small branches and twigs
notation: 011.9

Tops, small branches and twigs
type: Concept
broader: Other wood fuel (tops, small branches and twigs; stumps and roots; bark)
definition: It includes wood from other parts than main stem and branches where these are harvested for fuel, e.g. tops, small branches and twigs, stumps and roots, bark separated in the forest from wood in the rough.
in scheme: Forest Products Classification and Definitions (FPC&D) v2022
narrower: Tops, small branches and twigs, tropical non-coniferous
narrower: Other tops, small branches and twigs
narrower: Tops, small branches and twigs, coniferous
notation: 011.91

Tops, small branches and twigs, coniferous
type: Concept
broader: Tops, small branches and twigs
definition: N.A.
in scheme: Forest Products Classification and Definitions (FPC&D) v2022
narrower: Tops, small branches and twigs, coniferous, for pellets
narrower: Tops, small branches and twigs, coniferous, for uses n.e.c.
notation: 011.911

Tops, small branches and twigs, coniferous, for pellets
type: Concept
broader: Tops, small branches and twigs, coniferous
definition: N.A.
in scheme: Forest Products Classification and Definitions (FPC&D) v2022
notation: 011.9111

Tops, small branches and twigs, coniferous, for uses n.e.c.
type: Concept
broader: Tops, small branches and twigs, coniferous
definition: N.A.
in scheme: Forest Products Classification and Definitions (FPC&D) v2022
notation: 011.9119

Tops, small branches and twigs, tropical non-coniferous
type: Concept
broader: Tops, small branches and twigs
definition: N.A.
in scheme: Forest Products Classification and Definitions (FPC&D) v2022
narrower: Tops, small branches and twigs, tropical non-coniferous, for pellets
narrower: Tops, small branches and twigs, tropical non-coniferous, for uses n.e.c.
notation: 011.912

Tops, small branches and twigs, tropical non-coniferous, for pellets
type: Concept
broader: Tops, small branches and twigs, tropical non-coniferous
definition: N.A.
in scheme: Forest Products Classification and Definitions (FPC&D) v2022
notation: 011.9121

Tops, small branches and twigs, tropical non-coniferous, for uses n.e.c.
type: Concept
broader: Tops, small branches and twigs, tropical non-coniferous
definition: N.A.
in scheme: Forest Products Classification and Definitions (FPC&D) v2022
notation: 011.9129

Other tops, small branches and twigs
type: Concept
broader: Tops, small branches and twigs
definition: N.A.
in scheme: Forest Products Classification and Definitions (FPC&D) v2022
narrower: Other tops, small branches and twigs, for pellets
narrower: Other tops, small branches and twigs, for uses n.e.c.
notation: 011.919

Other tops, small branches and twigs, for pellets
type: Concept
broader: Other tops, small branches and twigs
definition: N.A.
in scheme: Forest Products Classification and Definitions (FPC&D) v2022
notation: 011.9191

Other tops, small branches and twigs, for uses n.e.c.
type: Concept
broader: Other tops, small branches and twigs
definition: N.A.
in scheme: Forest Products Classification and Definitions (FPC&D) v2022
notation: 011.9199

Stumps and roots
type: Concept
broader: Other wood fuel (tops, small branches and twigs; stumps and roots; bark)
definition: It includes wood from other parts than main stem and branches where these are harvested for fuel, e.g. tops, small branches and twigs, stumps and roots, bark separated in the forest from wood in the rough.
in scheme: Forest Products Classification and Definitions (FPC&D) v2022
narrower: Stumps and roots, tropical non-coniferous
narrower: Stumps and roots, coniferous
narrower: Other stumps and roots
notation: 011.92

Stumps and roots, coniferous
type: Concept
broader: Stumps and roots
definition: N.A.
in scheme: Forest Products Classification and Definitions (FPC&D) v2022
narrower: Stumps and roots, coniferous, for uses n.e.c.
narrower: Stumps and roots, coniferous, for pellets
notation: 011.921

Stumps and roots, coniferous, for pellets
type: Concept
broader: Stumps and roots, coniferous
definition: N.A.
in scheme: Forest Products Classification and Definitions (FPC&D) v2022
notation: 011.9211

Stumps and roots, coniferous, for uses n.e.c.
type: Concept
broader: Stumps and roots, coniferous
definition: N.A.
in scheme: Forest Products Classification and Definitions (FPC&D) v2022
notation: 011.9219

Stumps and roots, tropical non-coniferous
type: Concept
broader: Stumps and roots
definition: N.A.
in scheme: Forest Products Classification and Definitions (FPC&D) v2022
narrower: Stumps and roots, tropical non-coniferous, for pellets
narrower: Stumps and roots, tropical non-coniferous, for uses n.e.c.
notation: 011.922

Stumps and roots, tropical non-coniferous, for pellets
type: Concept
broader: Stumps and roots, tropical non-coniferous
definition: N.A.
in scheme: Forest Products Classification and Definitions (FPC&D) v2022
notation: 011.9221

Stumps and roots, tropical non-coniferous, for uses n.e.c.
type: Concept
broader: Stumps and roots, tropical non-coniferous
definition: N.A.
in scheme: Forest Products Classification and Definitions (FPC&D) v2022
notation: 011.9229

Other stumps and roots
type: Concept
broader: Stumps and roots
definition: N.A.
in scheme: Forest Products Classification and Definitions (FPC&D) v2022
narrower: Other stumps and roots, for uses n.e.c.
narrower: Other stumps and roots, for pellets
notation: 011.929

Other stumps and roots, for pellets
type: Concept
broader: Other stumps and roots
definition: N.A.
in scheme: Forest Products Classification and Definitions (FPC&D) v2022
notation: 011.9291

Other stumps and roots, for uses n.e.c.
type: Concept
broader: Other stumps and roots
definition: N.A.
in scheme: Forest Products Classification and Definitions (FPC&D) v2022
notation: 011.9299

Bark separated in the forest from wood in the rough
type: Concept
broader: Other wood fuel (tops, small branches and twigs; stumps and roots; bark)
definition: It includes wood from other parts than main stem and branches where these are harvested for fuel, e.g. tops, small branches and twigs, stumps and roots, bark separated in the forest from wood in the rough.
in scheme: Forest Products Classification and Definitions (FPC&D) v2022
narrower: Bark separated in the forest from wood in the rough, coniferous
narrower: Bark separated in the forest from wood in the rough, tropical non-coniferous
narrower: Other bark separated in the forest from wood in the rough
notation: 011.93

Bark separated in the forest from wood in the rough, coniferous
type: Concept
broader: Bark separated in the forest from wood in the rough
definition: N.A.
in scheme: Forest Products Classification and Definitions (FPC&D) v2022
notation: 011.931

Bark separated in the forest from wood in the rough, tropical non-coniferous
type: Concept
broader: Bark separated in the forest from wood in the rough
definition: N.A.
in scheme: Forest Products Classification and Definitions (FPC&D) v2022
notation: 011.932

Other bark separated in the forest from wood in the rough
type: Concept
broader: Bark separated in the forest from wood in the rough
definition: N.A.
in scheme: Forest Products Classification and Definitions (FPC&D) v2022
notation: 011.939

WOOD IN THE ROUGH OTHER THAN WOOD FUEL
type: Concept
broader: WOOD IN THE ROUGH (ROUNDWOOD)
definition: Wood in the rough that will be used in the production of other goods and services (except as a source of fuel).
in scheme: Forest Products Classification and Definitions (FPC&D) v2022
narrower: Wood in the rough from the main stem and branches
narrower: Wood in the rough other than from the main stem and branches
notation: 012.

Wood in the rough from the main stem and branches
type: Concept
broader: WOOD IN THE ROUGH OTHER THAN WOOD FUEL
definition: Wood in the rough from the main stem and branches that will be used in the production of other goods and services (except as a source of fuel). It includes sawlogs and veneer logs; pulpwood, round and split; and other industrial roundwood.
in scheme: Forest Products Classification and Definitions (FPC&D) v2022
narrower: Other industrial roundwood
narrower: Sawlogs and veneer logs
narrower: Pulpwood, round and split and wood for wood-based panels
notation: 012.1

Sawlogs and veneer logs
type: Concept
broader: Wood in the rough from the main stem and branches
definition: Roundwood that will be sawn (or chipped) lengthways for the manufacture of sawnwood or railway sleepers (ties) or used for the production of veneer (mainly by peeling or slicing). It includes: roundwood (whether or not it is roughly squared) that will be used for these purposes; shingle bolts and stave bolts; match billets and other special types of roundwood (e.g. burls and roots, etc.) used for veneer production.
in scheme: Forest Products Classification and Definitions (FPC&D) v2022
narrower: Other sawlogs and veneer logs
narrower: Sawlogs and veneer logs, tropical non-coniferous
narrower: Sawlogs and veneer logs, coniferous
notation: 012.11

Sawlogs and veneer logs, coniferous
type: Concept
broader: Sawlogs and veneer logs
definition: Roundwood that will be sawn (or chipped) lengthways for the manufacture of sawnwood or railway sleepers (ties) or used for the production of veneer (mainly by peeling or slicing). It includes: roundwood (whether or not it is roughly squared) that will be used for these purposes; shingle bolts and stave bolts; match billets and other special types of roundwood (e.g. burls and roots, etc.) used for veneer production.
in scheme: Forest Products Classification and Definitions (FPC&D) v2022
narrower: Sawlogs and veneer logs, coniferous, for uses n.e.c.
narrower: Sawlogs and veneer logs, coniferous, for sawnwood and railway sleepers
narrower: Sawlogs and veneer logs, coniferous, for veneer sheets
notation: 012.111

Sawlogs and veneer logs, coniferous, for sawnwood and railway sleepers
type: Concept
broader: Sawlogs and veneer logs, coniferous
definition: N.A.
in scheme: Forest Products Classification and Definitions (FPC&D) v2022
notation: 012.1111

Sawlogs and veneer logs, coniferous, for veneer sheets
type: Concept
broader: Sawlogs and veneer logs, coniferous
definition: N.A.
in scheme: Forest Products Classification and Definitions (FPC&D) v2022
notation: 012.1112

Sawlogs and veneer logs, coniferous, for uses n.e.c.
type: Concept
broader: Sawlogs and veneer logs, coniferous
definition: N.A.
in scheme: Forest Products Classification and Definitions (FPC&D) v2022
notation: 012.1119

Sawlogs and veneer logs, tropical non-coniferous
type: Concept
broader: Sawlogs and veneer logs
definition: Roundwood that will be sawn (or chipped) lengthways for the manufacture of sawnwood or railway sleepers (ties) or used for the production of veneer (mainly by peeling or slicing). It includes: roundwood (whether or not it is roughly squared) that will be used for these purposes; shingle bolts and stave bolts; match billets and other special types of roundwood (e.g. burls and roots, etc.) used for veneer production.
in scheme: Forest Products Classification and Definitions (FPC&D) v2022
narrower: Sawlogs and veneer logs, tropical non-coniferous, for sawnwood and railway sleepers
narrower: Sawlogs and veneer logs, tropical non-coniferous, for veneer sheets
narrower: Sawlogs and veneer logs, tropical non-coniferous, for uses n.e.c.
notation: 012.112

Sawlogs and veneer logs, tropical non-coniferous, for sawnwood and railway sleepers
type: Concept
broader: Sawlogs and veneer logs, tropical non-coniferous
definition: N.A.
in scheme: Forest Products Classification and Definitions (FPC&D) v2022
notation: 012.1121

Sawlogs and veneer logs, tropical non-coniferous, for veneer sheets
type: Concept
broader: Sawlogs and veneer logs, tropical non-coniferous
definition: N.A.
in scheme: Forest Products Classification and Definitions (FPC&D) v2022
notation: 012.1122

Sawlogs and veneer logs, tropical non-coniferous, for uses n.e.c.
type: Concept
broader: Sawlogs and veneer logs, tropical non-coniferous
definition: N.A.
in scheme: Forest Products Classification and Definitions (FPC&D) v2022
notation: 012.1129

Other sawlogs and veneer logs
type: Concept
broader: Sawlogs and veneer logs
definition: Roundwood that will be sawn (or chipped) lengthways for the manufacture of sawnwood or railway sleepers (ties) or used for the production of veneer (mainly by peeling or slicing). It includes: roundwood (whether or not it is roughly squared) that will be used for these purposes; shingle bolts and stave bolts; match billets and other special types of roundwood (e.g. burls and roots, etc.) used for veneer production.
in scheme: Forest Products Classification and Definitions (FPC&D) v2022
narrower: Other sawlogs and veneer logs, for veneer sheets
narrower: Other sawlogs and veneer logs, for uses n.e.c.
narrower: Other sawlogs and veneer logs, for sawnwood and railway sleepers
notation: 012.119

Other sawlogs and veneer logs, for sawnwood and railway sleepers
type: Concept
broader: Other sawlogs and veneer logs
definition: N.A.
in scheme: Forest Products Classification and Definitions (FPC&D) v2022
notation: 012.1191

Other sawlogs and veneer logs, for veneer sheets
type: Concept
broader: Other sawlogs and veneer logs
definition: N.A.
in scheme: Forest Products Classification and Definitions (FPC&D) v2022
notation: 012.1192

Other sawlogs and veneer logs, for uses n.e.c.
type: Concept
broader: Other sawlogs and veneer logs
definition: N.A.
in scheme: Forest Products Classification and Definitions (FPC&D) v2022
notation: 012.1199

Pulpwood, round and split and wood for wood-based panels
type: Concept
broader: Wood in the rough from the main stem and branches
definition: Roundwood that will be used for the production of pulp, particleboard, oriented strand board (OSB) or fibreboard. It includes: roundwood (with or without bark) that will be used for these purposes in its round form or as splitwood or wood chips made directly (i.e. in the forest) from roundwood
in scheme: Forest Products Classification and Definitions (FPC&D) v2022
narrower: Pulpwood and wood for wood-based panels, coniferous
narrower: Other pulpwood and wood for wood-based panels
narrower: Pulpwood and wood for wood-based panels, tropical non-coniferous
notation: 012.12

Pulpwood and wood for wood-based panels, coniferous
type: Concept
broader: Pulpwood, round and split and wood for wood-based panels
definition: Roundwood that will be used for the production of pulp, particleboard, oriented strand board (OSB) or fibreboard. It includes: roundwood (with or without bark) that will be used for these purposes in its round form or as splitwood or wood chips made directly (i.e. in the forest) from roundwood
in scheme: Forest Products Classification and Definitions (FPC&D) v2022
narrower: Pulpwood and wood for wood-based panels, coniferous, for pulp
narrower: Pulpwood and wood for wood-based panels, coniferous, for fibreboard
narrower: Pulpwood and wood for wood-based panels, coniferous, for particle board
narrower: Pulpwood and wood for wood-based panels, coniferous, for wood wool
narrower: Pulpwood and wood for wood-based panels, coniferous, for uses n.e.c.
notation: 012.121

Pulpwood and wood for wood-based panels, coniferous, for pulp
type: Concept
broader: Pulpwood and wood for wood-based panels, coniferous
definition: N.A.
in scheme: Forest Products Classification and Definitions (FPC&D) v2022
notation: 012.1211

Pulpwood and wood for wood-based panels, coniferous, for particle board
type: Concept
broader: Pulpwood and wood for wood-based panels, coniferous
definition: N.A.
in scheme: Forest Products Classification and Definitions (FPC&D) v2022
notation: 012.1212

Pulpwood and wood for wood-based panels, coniferous, for fibreboard
type: Concept
broader: Pulpwood and wood for wood-based panels, coniferous
definition: N.A.
in scheme: Forest Products Classification and Definitions (FPC&D) v2022
notation: 012.1213

Pulpwood and wood for wood-based panels, coniferous, for wood wool
type: Concept
broader: Pulpwood and wood for wood-based panels, coniferous
definition: N.A.
in scheme: Forest Products Classification and Definitions (FPC&D) v2022
notation: 012.1214

Pulpwood and wood for wood-based panels, coniferous, for uses n.e.c.
type: Concept
broader: Pulpwood and wood for wood-based panels, coniferous
definition: N.A.
in scheme: Forest Products Classification and Definitions (FPC&D) v2022
notation: 012.1219

Pulpwood and wood for wood-based panels, tropical non-coniferous
type: Concept
broader: Pulpwood, round and split and wood for wood-based panels
definition: Roundwood that will be used for the production of pulp, particleboard, oriented strand board (OSB) or fibreboard. It includes: roundwood (with or without bark) that will be used for these purposes in its round form or as splitwood or wood chips made directly (i.e. in the forest) from roundwood
in scheme: Forest Products Classification and Definitions (FPC&D) v2022
narrower: Pulpwood and wood for wood-based panels, tropical non-coniferous, for uses n.e.c.
narrower: Pulpwood and wood for wood-based panels, tropical non-coniferous, for particle board
narrower: Pulpwood and wood for wood-based panels, tropical non-coniferous, for wood wool
narrower: Pulpwood and wood for wood-based panels, tropical non-coniferous, for fibreboard
narrower: Pulpwood and wood for wood-based panels, tropical non-coniferous, for pulp
notation: 012.122

Pulpwood and wood for wood-based panels, tropical non-coniferous, for pulp
type: Concept
broader: Pulpwood and wood for wood-based panels, tropical non-coniferous
definition: N.A.
in scheme: Forest Products Classification and Definitions (FPC&D) v2022
notation: 012.1221

Pulpwood and wood for wood-based panels, tropical non-coniferous, for particle board
type: Concept
broader: Pulpwood and wood for wood-based panels, tropical non-coniferous
definition: N.A.
in scheme: Forest Products Classification and Definitions (FPC&D) v2022
notation: 012.1222

Pulpwood and wood for wood-based panels, tropical non-coniferous, for fibreboard
type: Concept
broader: Pulpwood and wood for wood-based panels, tropical non-coniferous
definition: N.A.
in scheme: Forest Products Classification and Definitions (FPC&D) v2022
notation: 012.1223

Pulpwood and wood for wood-based panels, tropical non-coniferous, for wood wool
type: Concept
broader: Pulpwood and wood for wood-based panels, tropical non-coniferous
definition: N.A.
in scheme: Forest Products Classification and Definitions (FPC&D) v2022
notation: 012.1224

Pulpwood and wood for wood-based panels, tropical non-coniferous, for uses n.e.c.
type: Concept
broader: Pulpwood and wood for wood-based panels, tropical non-coniferous
definition: N.A.
in scheme: Forest Products Classification and Definitions (FPC&D) v2022
notation: 012.1229

Other pulpwood and wood for wood-based panels
type: Concept
broader: Pulpwood, round and split and wood for wood-based panels
definition: Roundwood that will be used for the production of pulp, particleboard, oriented strand board (OSB) or fibreboard. It includes: roundwood (with or without bark) that will be used for these purposes in its round form or as splitwood or wood chips made directly (i.e. in the forest) from roundwood
in scheme: Forest Products Classification and Definitions (FPC&D) v2022
narrower: Other pulpwood and wood for wood-based panels, for fibreboard
narrower: Other pulpwood and wood for wood-based panels, for pulp
narrower: Other pulpwood and wood for wood-based panels, for particle board
narrower: Other pulpwood and wood for wood-based panels, for wood wool
narrower: Other pulpwood and wood for wood-based panels, for uses n.e.c.
notation: 012.129

Other pulpwood and wood for wood-based panels, for pulp
type: Concept
broader: Other pulpwood and wood for wood-based panels
definition: N.A.
in scheme: Forest Products Classification and Definitions (FPC&D) v2022
notation: 012.1291

Other pulpwood and wood for wood-based panels, for particle board
type: Concept
broader: Other pulpwood and wood for wood-based panels
definition: N.A.
in scheme: Forest Products Classification and Definitions (FPC&D) v2022
notation: 012.1292

Other pulpwood and wood for wood-based panels, for fibreboard
type: Concept
broader: Other pulpwood and wood for wood-based panels
definition: N.A.
in scheme: Forest Products Classification and Definitions (FPC&D) v2022
notation: 012.1293

Other pulpwood and wood for wood-based panels, for wood wool
type: Concept
broader: Other pulpwood and wood for wood-based panels
definition: N.A.
in scheme: Forest Products Classification and Definitions (FPC&D) v2022
notation: 012.1294

Other pulpwood and wood for wood-based panels, for uses n.e.c.
type: Concept
broader: Other pulpwood and wood for wood-based panels
definition: N.A.
in scheme: Forest Products Classification and Definitions (FPC&D) v2022
notation: 012.1299

Other industrial roundwood
type: Concept
broader: Wood in the rough from the main stem and branches
definition: Industrial roundwood (wood in the rough) other than sawlogs, veneer logs and/or pulpwood. It includes roundwood that will be used for poles, piling, posts, fencing, pitprops, tanning, distillation and match blocks, etc.
in scheme: Forest Products Classification and Definitions (FPC&D) v2022
narrower: Other industrial roundwood n.e.c.
narrower: Other industrial roundwood, tropical non-coniferous
narrower: Other industrial roundwood, coniferous
notation: 012.13

Other industrial roundwood, coniferous
type: Concept
broader: Other industrial roundwood
definition: Industrial roundwood (wood in the rough) other than sawlogs, veneer logs and/or pulpwood. It includes roundwood that will be used for poles, piling, posts, fencing, pitprops, tanning, distillation and match blocks, etc.
in scheme: Forest Products Classification and Definitions (FPC&D) v2022
narrower: Other industrial roundwood, coniferous, used for poles
narrower: Other industrial roundwood, coniferous, used for piling
narrower: Other industrial roundwood, coniferous, used for pitprops
narrower: Other industrial roundwood, coniferous, used for posts
narrower: Other industrial roundwood, coniferous, for other uses in the rough (fencing, …)
narrower: Other industrial roundwood, coniferous, for other uses - tanning, distillation, match blocks, gazogenes
notation: 012.131

Other industrial roundwood, coniferous, used for poles
type: Concept
broader: Other industrial roundwood, coniferous
definition: N.A.
in scheme: Forest Products Classification and Definitions (FPC&D) v2022
notation: 012.1311

Other industrial roundwood, coniferous, used for piling
type: Concept
broader: Other industrial roundwood, coniferous
definition: N.A.
in scheme: Forest Products Classification and Definitions (FPC&D) v2022
notation: 012.1312

Other industrial roundwood, coniferous, used for pitprops
type: Concept
broader: Other industrial roundwood, coniferous
definition: N.A.
in scheme: Forest Products Classification and Definitions (FPC&D) v2022
notation: 012.1313

Other industrial roundwood, coniferous, used for posts
type: Concept
broader: Other industrial roundwood, coniferous
definition: N.A.
in scheme: Forest Products Classification and Definitions (FPC&D) v2022
notation: 012.1314

Other industrial roundwood, coniferous, for other uses in the rough (fencing, …)
type: Concept
broader: Other industrial roundwood, coniferous
definition: N.A.
in scheme: Forest Products Classification and Definitions (FPC&D) v2022
notation: 012.1315

Other industrial roundwood, coniferous, for other uses - tanning, distillation, match blocks, gazogenes
type: Concept
broader: Other industrial roundwood, coniferous
definition: N.A.
in scheme: Forest Products Classification and Definitions (FPC&D) v2022
notation: 012.1319

Other industrial roundwood, tropical non-coniferous
type: Concept
broader: Other industrial roundwood
definition: Industrial roundwood (wood in the rough) other than sawlogs, veneer logs and/or pulpwood. It includes roundwood that will be used for poles, piling, posts, fencing, pitprops, tanning, distillation and match blocks, etc.
in scheme: Forest Products Classification and Definitions (FPC&D) v2022
narrower: Other industrial roundwood, tropical non-coniferous, used for poles
narrower: Other industrial roundwood, tropical non-coniferous, used for piling
narrower: Other industrial roundwood, tropical non-coniferous, used for pitprops
narrower: Other industrial roundwood, tropical non-coniferous, used for posts
narrower: Other industrial roundwood, tropical non-coniferous, for other uses in the rough (fencing, …)
narrower: Other industrial roundwood, tropical non-coniferous, for other uses - tanning, distillation, match blocks, gazogenes
notation: 012.132

Other industrial roundwood, tropical non-coniferous, used for poles
type: Concept
broader: Other industrial roundwood, tropical non-coniferous
definition: N.A.
in scheme: Forest Products Classification and Definitions (FPC&D) v2022
notation: 012.1321

Other industrial roundwood, tropical non-coniferous, used for piling
type: Concept
broader: Other industrial roundwood, tropical non-coniferous
definition: N.A.
in scheme: Forest Products Classification and Definitions (FPC&D) v2022
notation: 012.1322

Other industrial roundwood, tropical non-coniferous, used for pitprops
type: Concept
broader: Other industrial roundwood, tropical non-coniferous
definition: N.A.
in scheme: Forest Products Classification and Definitions (FPC&D) v2022
notation: 012.1323

Other industrial roundwood, tropical non-coniferous, used for posts
type: Concept
broader: Other industrial roundwood, tropical non-coniferous
definition: N.A.
in scheme: Forest Products Classification and Definitions (FPC&D) v2022
notation: 012.1324

Other industrial roundwood, tropical non-coniferous, for other uses in the rough (fencing, …)
type: Concept
broader: Other industrial roundwood, tropical non-coniferous
definition: N.A.
in scheme: Forest Products Classification and Definitions (FPC&D) v2022
notation: 012.1325

Other industrial roundwood, tropical non-coniferous, for other uses - tanning, distillation, match blocks, gazogenes
type: Concept
broader: Other industrial roundwood, tropical non-coniferous
definition: N.A.
in scheme: Forest Products Classification and Definitions (FPC&D) v2022
notation: 012.1329

Other industrial roundwood n.e.c.
type: Concept
broader: Other industrial roundwood
definition: Industrial roundwood (wood in the rough) other than sawlogs, veneer logs and/or pulpwood. It includes roundwood that will be used for poles, piling, posts, fencing, pitprops, tanning, distillation and match blocks, etc.
in scheme: Forest Products Classification and Definitions (FPC&D) v2022
narrower: Other industrial roundwood n.e.c., used for posts
narrower: Other industrial roundwood n.e.c., used for poles
narrower: Other industrial roundwood n.e.c., used for piling
narrower: Other industrial roundwood n.e.c., used for pitprops
narrower: Other industrial roundwood n.e.c., for other uses in the rough (fencing, …)
narrower: Other industrial roundwood n.e.c., for other uses - tanning, distillation, match blocks, gazogenes
notation: 012.139

Other industrial roundwood n.e.c., used for poles
type: Concept
broader: Other industrial roundwood n.e.c.
definition: N.A.
in scheme: Forest Products Classification and Definitions (FPC&D) v2022
notation: 012.1391

Other industrial roundwood n.e.c., used for piling
type: Concept
broader: Other industrial roundwood n.e.c.
definition: N.A.
in scheme: Forest Products Classification and Definitions (FPC&D) v2022
notation: 012.1392

Other industrial roundwood n.e.c., used for pitprops
type: Concept
broader: Other industrial roundwood n.e.c.
definition: N.A.
in scheme: Forest Products Classification and Definitions (FPC&D) v2022
notation: 012.1393

Other industrial roundwood n.e.c., used for posts
type: Concept
broader: Other industrial roundwood n.e.c.
definition: N.A.
in scheme: Forest Products Classification and Definitions (FPC&D) v2022
notation: 012.1394

Other industrial roundwood n.e.c., for other uses in the rough (fencing, …)
type: Concept
broader: Other industrial roundwood n.e.c.
definition: N.A.
in scheme: Forest Products Classification and Definitions (FPC&D) v2022
notation: 012.1395

Other industrial roundwood n.e.c., for other uses - tanning, distillation, match blocks, gazogenes
type: Concept
broader: Other industrial roundwood n.e.c.
definition: N.A.
in scheme: Forest Products Classification and Definitions (FPC&D) v2022
notation: 012.1399

Wood in the rough other than from the main stem and branches
type: Concept
broader: WOOD IN THE ROUGH OTHER THAN WOOD FUEL
definition: Includes tops, small branches, twigs, stumps, roots and bark removed in the forest that will be used in the production of other goods and services (except as a source of fuel).
in scheme: Forest Products Classification and Definitions (FPC&D) v2022
narrower: Tops, small branches and twigs
narrower: Bark separated in the forest from wood in the rough
narrower: Stumps and roots
notation: 012.2

Tops, small branches and twigs
type: Concept
broader: Wood in the rough other than from the main stem and branches
definition: Includes tops, small branches and twigs from felled trees. The lower limit of the top (the upper limit of the stem) will vary according to local logging practices
in scheme: Forest Products Classification and Definitions (FPC&D) v2022
narrower: Tops, small branches and twigs, coniferous
narrower: Tops, small branches and twigs, tropical non-coniferous
narrower: Other tops, small branches and twigs
notation: 012.21

Tops, small branches and twigs, coniferous
type: Concept
broader: Tops, small branches and twigs
definition: Includes tops, small branches and twigs from felled trees. The lower limit of the top (the upper limit of the stem) will vary according to local logging practices
in scheme: Forest Products Classification and Definitions (FPC&D) v2022
narrower: Tops, small branches and twigs, coniferous, for fibreboard
narrower: Tops, small branches and twigs, coniferous, for pulp
narrower: Tops, small branches and twigs, coniferous, for particle board
narrower: Tops, small branches and twigs, coniferous, for uses n.e.c.
notation: 012.211

Tops, small branches and twigs, coniferous, for pulp
type: Concept
broader: Tops, small branches and twigs, coniferous
definition: N.A.
in scheme: Forest Products Classification and Definitions (FPC&D) v2022
notation: 012.2111

Tops, small branches and twigs, coniferous, for particle board
type: Concept
broader: Tops, small branches and twigs, coniferous
definition: N.A.
in scheme: Forest Products Classification and Definitions (FPC&D) v2022
notation: 012.2112

Tops, small branches and twigs, coniferous, for fibreboard
type: Concept
broader: Tops, small branches and twigs, coniferous
definition: N.A.
in scheme: Forest Products Classification and Definitions (FPC&D) v2022
notation: 012.2113

Tops, small branches and twigs, coniferous, for uses n.e.c.
type: Concept
broader: Tops, small branches and twigs, coniferous
definition: N.A.
in scheme: Forest Products Classification and Definitions (FPC&D) v2022
notation: 012.2119

Tops, small branches and twigs, tropical non-coniferous
type: Concept
broader: Tops, small branches and twigs
definition: Includes tops, small branches and twigs from felled trees. The lower limit of the top (the upper limit of the stem) will vary according to local logging practices
in scheme: Forest Products Classification and Definitions (FPC&D) v2022
narrower: Tops, small branches and twigs, tropical non-coniferous, for fibreboard
narrower: Tops, small branches and twigs, tropical non-coniferous, for particle board
narrower: Tops, small branches and twigs, tropical non-coniferous, for pulp
narrower: Tops, small branches and twigs, tropical non-coniferous, for uses n.e.c.
notation: 012.212

Tops, small branches and twigs, tropical non-coniferous, for pulp
type: Concept
broader: Tops, small branches and twigs, tropical non-coniferous
definition: N.A.
in scheme: Forest Products Classification and Definitions (FPC&D) v2022
notation: 012.2121

Tops, small branches and twigs, tropical non-coniferous, for particle board
type: Concept
broader: Tops, small branches and twigs, tropical non-coniferous
definition: N.A.
in scheme: Forest Products Classification and Definitions (FPC&D) v2022
notation: 012.2122

Tops, small branches and twigs, tropical non-coniferous, for fibreboard
type: Concept
broader: Tops, small branches and twigs, tropical non-coniferous
definition: N.A.
in scheme: Forest Products Classification and Definitions (FPC&D) v2022
notation: 012.2123

Tops, small branches and twigs, tropical non-coniferous, for uses n.e.c.
type: Concept
broader: Tops, small branches and twigs, tropical non-coniferous
definition: N.A.
in scheme: Forest Products Classification and Definitions (FPC&D) v2022
notation: 012.2129

Other tops, small branches and twigs
type: Concept
broader: Tops, small branches and twigs
definition: Includes tops, small branches and twigs from felled trees. The lower limit of the top (the upper limit of the stem) will vary according to local logging practices
in scheme: Forest Products Classification and Definitions (FPC&D) v2022
narrower: Other tops, small branches and twigs, for pulp
narrower: Other tops, small branches and twigs, for particle board
narrower: Other tops, small branches and twigs, for fibreboard
narrower: Other tops, small branches and twigs, for uses n.e.c.
notation: 012.219

Other tops, small branches and twigs, for pulp
type: Concept
broader: Other tops, small branches and twigs
definition: N.A.
in scheme: Forest Products Classification and Definitions (FPC&D) v2022
notation: 012.2191

Other tops, small branches and twigs, for particle board
type: Concept
broader: Other tops, small branches and twigs
definition: N.A.
in scheme: Forest Products Classification and Definitions (FPC&D) v2022
notation: 012.2192

Other tops, small branches and twigs, for fibreboard
type: Concept
broader: Other tops, small branches and twigs
definition: N.A.
in scheme: Forest Products Classification and Definitions (FPC&D) v2022
notation: 012.2193

Other tops, small branches and twigs, for uses n.e.c.
type: Concept
broader: Other tops, small branches and twigs
definition: N.A.
in scheme: Forest Products Classification and Definitions (FPC&D) v2022
notation: 012.2199

Stumps and roots
type: Concept
broader: Wood in the rough other than from the main stem and branches
definition: Includes all the biomass of the tree below the separation of the harvested stem. The height of this cut will vary according to local practices and conditions.
in scheme: Forest Products Classification and Definitions (FPC&D) v2022
narrower: Other stumps and roots
narrower: Stumps and roots, tropical non-coniferous
narrower: Stumps and roots, coniferous
notation: 012.22

Stumps and roots, coniferous
type: Concept
broader: Stumps and roots
definition: Includes all the biomass of the tree below the separation of the harvested stem. The height of this cut will vary according to local practices and conditions.
in scheme: Forest Products Classification and Definitions (FPC&D) v2022
narrower: Stumps and roots, coniferous, for uses n.e.c.
narrower: Stumps and roots, coniferous, for particle board
narrower: Stumps and roots, coniferous, for pulp
narrower: Stumps and roots, coniferous, for fibreboard
notation: 012.221

Stumps and roots, coniferous, for pulp
type: Concept
broader: Stumps and roots, coniferous
definition: N.A.
in scheme: Forest Products Classification and Definitions (FPC&D) v2022
notation: 012.2211

Stumps and roots, coniferous, for particle board
type: Concept
broader: Stumps and roots, coniferous
definition: N.A.
in scheme: Forest Products Classification and Definitions (FPC&D) v2022
notation: 012.2212

Stumps and roots, coniferous, for fibreboard
type: Concept
broader: Stumps and roots, coniferous
definition: N.A.
in scheme: Forest Products Classification and Definitions (FPC&D) v2022
notation: 012.2213

Stumps and roots, coniferous, for uses n.e.c.
type: Concept
broader: Stumps and roots, coniferous
definition: N.A.
in scheme: Forest Products Classification and Definitions (FPC&D) v2022
notation: 012.2219

Stumps and roots, tropical non-coniferous
type: Concept
broader: Stumps and roots
definition: Includes all the biomass of the tree below the separation of the harvested stem. The height of this cut will vary according to local practices and conditions.
in scheme: Forest Products Classification and Definitions (FPC&D) v2022
narrower: Stumps and roots, tropical non-coniferous, for uses n.e.c.
narrower: Stumps and roots, tropical non-coniferous, for fibreboard
narrower: Stumps and roots, tropical non-coniferous, for particle board
narrower: Stumps and roots, tropical non-coniferous, for pulp
notation: 012.222

Stumps and roots, tropical non-coniferous, for pulp
type: Concept
broader: Stumps and roots, tropical non-coniferous
definition: N.A.
in scheme: Forest Products Classification and Definitions (FPC&D) v2022
notation: 012.2221

Stumps and roots, tropical non-coniferous, for particle board
type: Concept
broader: Stumps and roots, tropical non-coniferous
definition: N.A.
in scheme: Forest Products Classification and Definitions (FPC&D) v2022
notation: 012.2222

Stumps and roots, tropical non-coniferous, for fibreboard
type: Concept
broader: Stumps and roots, tropical non-coniferous
definition: N.A.
in scheme: Forest Products Classification and Definitions (FPC&D) v2022
notation: 012.2223

Stumps and roots, tropical non-coniferous, for uses n.e.c.
type: Concept
broader: Stumps and roots, tropical non-coniferous
definition: N.A.
in scheme: Forest Products Classification and Definitions (FPC&D) v2022
notation: 012.2229

Other stumps and roots
type: Concept
broader: Stumps and roots
definition: Includes all the biomass of the tree below the separation of the harvested stem. The height of this cut will vary according to local practices and conditions.
in scheme: Forest Products Classification and Definitions (FPC&D) v2022
narrower: Other stumps and roots, for pulp
narrower: Other stumps and roots, for particle board
narrower: Other stumps and roots, for fibreboard
narrower: Other stumps and roots, for uses n.e.c.
notation: 012.229

Other stumps and roots, for pulp
type: Concept
broader: Other stumps and roots
definition: N.A.
in scheme: Forest Products Classification and Definitions (FPC&D) v2022
notation: 012.2291

Other stumps and roots, for particle board
type: Concept
broader: Other stumps and roots
definition: N.A.
in scheme: Forest Products Classification and Definitions (FPC&D) v2022
notation: 012.2292

Other stumps and roots, for fibreboard
type: Concept
broader: Other stumps and roots
definition: N.A.
in scheme: Forest Products Classification and Definitions (FPC&D) v2022
notation: 012.2293

Other stumps and roots, for uses n.e.c.
type: Concept
broader: Other stumps and roots
definition: N.A.
in scheme: Forest Products Classification and Definitions (FPC&D) v2022
notation: 012.2299

Bark separated in the forest from wood in the rough
type: Concept
broader: Wood in the rough other than from the main stem and branches
definition: Includes all bark removed from the sterns or other parts of the tree during harvesting operations, as well as bark removed at the lower landing. It can be used for horticulture purposes or for other uses.
in scheme: Forest Products Classification and Definitions (FPC&D) v2022
narrower: Bark separated in the forest from wood in the rough, coniferous
narrower: Other bark separated in the forest from wood in the rough
narrower: Bark separated in the forest from wood in the rough, tropical non-coniferous
notation: 012.23

Bark separated in the forest from wood in the rough, coniferous
type: Concept
broader: Bark separated in the forest from wood in the rough
definition: Includes all bark removed from the sterns or other parts of the tree during harvesting operations, as well as bark removed at the lower landing. It can be used for horticulture purposes or for other uses.
in scheme: Forest Products Classification and Definitions (FPC&D) v2022
narrower: Bark separated in the forest from wood in the rough, coniferous, for horticulture purposes
narrower: Bark separated in the forest from wood in the rough, coniferous, for other uses n.e.c.
notation: 012.231

Bark separated in the forest from wood in the rough, coniferous, for horticulture purposes
type: Concept
broader: Bark separated in the forest from wood in the rough, coniferous
definition: N.A.
in scheme: Forest Products Classification and Definitions (FPC&D) v2022
notation: 012.2311

Bark separated in the forest from wood in the rough, coniferous, for other uses n.e.c.
type: Concept
broader: Bark separated in the forest from wood in the rough, coniferous
definition: N.A.
in scheme: Forest Products Classification and Definitions (FPC&D) v2022
notation: 012.2319

Bark separated in the forest from wood in the rough, tropical non-coniferous
type: Concept
broader: Bark separated in the forest from wood in the rough
definition: Includes all bark removed from the sterns or other parts of the tree during harvesting operations, as well as bark removed at the lower landing. It can be used for horticulture purposes or for other uses.
in scheme: Forest Products Classification and Definitions (FPC&D) v2022
narrower: Bark separated in the forest from wood in the rough, tropical non-coniferous, for horticulture purposes
narrower: Bark separated in the forest from wood in the rough, tropical non-coniferous, for uses n.e.c.
notation: 012.232

Bark separated in the forest from wood in the rough, tropical non-coniferous, for horticulture purposes
type: Concept
broader: Bark separated in the forest from wood in the rough, tropical non-coniferous
definition: N.A.
in scheme: Forest Products Classification and Definitions (FPC&D) v2022
notation: 012.2321

Bark separated in the forest from wood in the rough, tropical non-coniferous, for uses n.e.c.
type: Concept
broader: Bark separated in the forest from wood in the rough, tropical non-coniferous
definition: N.A.
in scheme: Forest Products Classification and Definitions (FPC&D) v2022
notation: 012.2329

Other bark separated in the forest from wood in the rough
type: Concept
broader: Bark separated in the forest from wood in the rough
definition: Includes all bark removed from the sterns or other parts of the tree during harvesting operations, as well as bark removed at the lower landing. It can be used for horticulture purposes or for other uses.
in scheme: Forest Products Classification and Definitions (FPC&D) v2022
narrower: Other bark separated in the forest from wood in the rough, for horticulture purposes
narrower: Other bark separated in the forest from wood in the rough, for uses n.e.c.
notation: 012.239

Other bark separated in the forest from wood in the rough, for horticulture purposes
type: Concept
broader: Other bark separated in the forest from wood in the rough
definition: N.A.
in scheme: Forest Products Classification and Definitions (FPC&D) v2022
notation: 012.2391

Other bark separated in the forest from wood in the rough, for uses n.e.c.
type: Concept
broader: Other bark separated in the forest from wood in the rough
definition: N.A.
in scheme: Forest Products Classification and Definitions (FPC&D) v2022
notation: 012.2399

WOOD SIMPLY WORKED OR PROCESSED
type: Concept
definition: This section includes wood charcoal; roughly trimmed wood suitable for the manufacture of walking sticks, umbrellas, tool handles etc.; wood wool and wood flour.
in scheme: Forest Products Classification and Definitions (FPC&D) v2022
narrower: Wood flour
narrower: Roundwood treated with preservatives
narrower: Torrefied wood
narrower: Wood wool
narrower: Roughly trimmed wood
narrower: Wood charcoal
narrower: Wood fuel simply worked
notation: 02
top concept of: Forest Products Classification and Definitions (FPC&D) v2022

Wood charcoal
type: Concept
broader: WOOD SIMPLY WORKED OR PROCESSED
definition: Wood carbonised by partial combustion or the application of heat from external sources. It can be in the form of blocks, sticks or in granules or powder, or agglomerated with tar or other substances in briquettes, tablets, balls, etc. It includes: charcoal used as a fuel or for other uses, e.g. as a reduction agent in metallurgy or as an absorption or filtration medium.
in scheme: Forest Products Classification and Definitions (FPC&D) v2022
narrower: Other wood charcoal
narrower: Wood charcoal, coniferous
notation: 021.

Wood charcoal, coniferous
type: Concept
broader: Wood charcoal
definition: Wood carbonised by partial combustion or the application of heat from external sources. It can be in the form of blocks, sticks or in granules or powder, or agglomerated with tar or other substances in briquettes, tablets, balls, etc. It includes: charcoal used as a fuel or for other uses, e.g. as a reduction agent in metallurgy or as an absorption or filtration medium. "
in scheme: Forest Products Classification and Definitions (FPC&D) v2022
narrower: Wood charcoal, coniferous, for energy
narrower: Wood charcoal, coniferous, for uses n.e.c.
notation: 021.1

Wood charcoal, coniferous, for energy
type: Concept
broader: Wood charcoal, coniferous
definition: N.A.
in scheme: Forest Products Classification and Definitions (FPC&D) v2022
notation: 021.11

Wood charcoal, coniferous, for uses n.e.c.
type: Concept
broader: Wood charcoal, coniferous
definition: N.A.
in scheme: Forest Products Classification and Definitions (FPC&D) v2022
notation: 021.19

Other wood charcoal
type: Concept
broader: Wood charcoal
definition: Wood carbonised by partial combustion or the application of heat from external sources. It can be in the form of blocks, sticks or in granules or powder, or agglomerated with tar or other substances in briquettes, tablets, balls, etc. It includes: charcoal used as a fuel or for other uses, e.g. as a reduction agent in metallurgy or as an absorption or filtration medium. "
in scheme: Forest Products Classification and Definitions (FPC&D) v2022
narrower: Other wood charcoal, for energy
narrower: Other wood charcoal, for uses n.e.c.
notation: 021.9

Other wood charcoal, for energy
type: Concept
broader: Other wood charcoal
definition: N.A.
in scheme: Forest Products Classification and Definitions (FPC&D) v2022
notation: 021.91

Other wood charcoal, for uses n.e.c.
type: Concept
broader: Other wood charcoal
definition: N.A.
in scheme: Forest Products Classification and Definitions (FPC&D) v2022
notation: 021.99

Torrefied wood
type: Concept
broader: WOOD SIMPLY WORKED OR PROCESSED
definition: It includes wood chips and wood pellets that were torrefied. In the torrefaction process, biomass is heated to a temperature of approx. 250-350°C in an atmosphere with low oxygen concentrations, so that all moisture is removed as well as a fraction of the volatile matter of the dry biomass. Due to the substantial weight loss and a relatively smaller loss of calorific content, the heating value of processed biomass per mass unit increases significantly in the process.
in scheme: Forest Products Classification and Definitions (FPC&D) v2022
narrower: Torrefied wood, coniferous
narrower: Other torrefied wood
notation: 022.

Torrefied wood, coniferous
type: Concept
broader: Torrefied wood
definition: It includes wood chips and wood pellets that were torrefied. In the torrefaction process, biomass is heated to a temperature of approx. 250-350°C in an atmosphere with low oxygen concentrations, so that all moisture is removed as well as a fraction of the volatile matter of the dry biomass. Due to the substantial weight loss and a relatively smaller loss of calorific content, the heating value of processed biomass per mass unit increases significantly in the process.
in scheme: Forest Products Classification and Definitions (FPC&D) v2022
narrower: Torrefied wood, coniferous, for energy
narrower: Torrefied wood, coniferous, for uses n.e.c.
notation: 022.1

Torrefied wood, coniferous, for energy
type: Concept
broader: Torrefied wood, coniferous
definition: N.A.
in scheme: Forest Products Classification and Definitions (FPC&D) v2022
notation: 022.11

Torrefied wood, coniferous, for uses n.e.c.
type: Concept
broader: Torrefied wood, coniferous
definition: N.A.
in scheme: Forest Products Classification and Definitions (FPC&D) v2022
notation: 022.19

Other torrefied wood
type: Concept
broader: Torrefied wood
definition: It includes wood chips and wood pellets that were torrefied. In the torrefaction process, biomass is heated to a temperature of approx. 250-350°C in an atmosphere with low oxygen concentrations, so that all moisture is removed as well as a fraction of the volatile matter of the dry biomass. Due to the substantial weight loss and a relatively smaller loss of calorific content, the heating value of processed biomass per mass unit increases significantly in the process.
in scheme: Forest Products Classification and Definitions (FPC&D) v2022
narrower: Other torrefied wood, for uses n.e.c.
narrower: Other torrefied wood, for energy
notation: 022.9

Other torrefied wood, for energy
type: Concept
broader: Other torrefied wood
definition: N.A.
in scheme: Forest Products Classification and Definitions (FPC&D) v2022
notation: 022.91

Other torrefied wood, for uses n.e.c.
type: Concept
broader: Other torrefied wood
definition: N.A.
in scheme: Forest Products Classification and Definitions (FPC&D) v2022
notation: 022.99

Roundwood treated with preservatives
type: Concept
broader: WOOD SIMPLY WORKED OR PROCESSED
definition: This group covers products which have been treated with paint, stains, creosote or other preservatives, in order to increase their resistance. It excludes: products treated with substances for the purpose of simply maintaining them during shipment or storage, torrefied pellets
in scheme: Forest Products Classification and Definitions (FPC&D) v2022
narrower: Roundwood treated with preservatives, coniferous
narrower: Other roundwood treated with preservatives
notation: 023.

Roundwood treated with preservatives, coniferous
type: Concept
broader: Roundwood treated with preservatives
definition: This group covers products which have been treated with paint, stains, creosote or other preservatives, in order to increase their resistance. It excludes: products treated with substances for the purpose of simply maintaining them during shipment or storage, torrefied pellets
in scheme: Forest Products Classification and Definitions (FPC&D) v2022
narrower: Roundwood treated with preservatives, coniferous, for posts
narrower: Roundwood treated with preservatives, coniferous, for poles
narrower: Roundwood treated with preservatives, coniferous, for piling
narrower: Roundwood treated with preservatives, coniferous, for uses n.e.c.
notation: 023.1

Roundwood treated with preservatives, coniferous, for poles
type: Concept
broader: Roundwood treated with preservatives, coniferous
definition: Straight pieces, usually of 5 m or more in length. They are used principally to support telephone, telegraph and electrical or transmission lines and for scaffolding.
in scheme: Forest Products Classification and Definitions (FPC&D) v2022
notation: 023.11

Roundwood treated with preservatives, coniferous, for piling
type: Concept
broader: Roundwood treated with preservatives, coniferous
definition: Long straight pieces, suitable for driving into the ground under impact. They are used principally in construction of harbour works and underpinning for bridges and buildings.
in scheme: Forest Products Classification and Definitions (FPC&D) v2022
notation: 023.12

Roundwood treated with preservatives, coniferous, for posts
type: Concept
broader: Roundwood treated with preservatives, coniferous
definition: Round, hewn, squared or split wood, usually less than 3 m in length, but possibly up to 5 m used for fencing, guard rails and the like.
in scheme: Forest Products Classification and Definitions (FPC&D) v2022
notation: 023.13

Roundwood treated with preservatives, coniferous, for uses n.e.c.
type: Concept
broader: Roundwood treated with preservatives, coniferous
definition: Roundwood treated with preservatives, other than poles, pilings and posts.
in scheme: Forest Products Classification and Definitions (FPC&D) v2022
notation: 023.19

Other roundwood treated with preservatives
type: Concept
broader: Roundwood treated with preservatives
definition: This group covers products which have been treated with paint, stains, creosote or other preservatives, in order to increase their resistance. It excludes: products treated with substances for the purpose of simply maintaining them during shipment or storage, torrefied pellets
in scheme: Forest Products Classification and Definitions (FPC&D) v2022
narrower: Other roundwood treated with preservatives, for poles
narrower: Other roundwood treated with preservatives, for posts
narrower: Other roundwood treated with preservatives, for uses n.e.c.
narrower: Other roundwood treated with preservatives, for piling
notation: 023.9

Other roundwood treated with preservatives, for poles
type: Concept
broader: Other roundwood treated with preservatives
definition: Straight pieces, usually of 5 m or more in length. They are used principally to support telephone, telegraph and electrical or transmission lines and for scaffolding.
in scheme: Forest Products Classification and Definitions (FPC&D) v2022
notation: 023.91

Other roundwood treated with preservatives, for piling
type: Concept
broader: Other roundwood treated with preservatives
definition: Long straight pieces, suitable for driving into the ground under impact. They are used principally in construction of harbour works and underpinning for bridges and buildings.
in scheme: Forest Products Classification and Definitions (FPC&D) v2022
notation: 023.92

Other roundwood treated with preservatives, for posts
type: Concept
broader: Other roundwood treated with preservatives
definition: Round, hewn, squared or split wood, usually less than 3 m in length, but possibly up to 5 m used for fencing, guard rails and the like.
in scheme: Forest Products Classification and Definitions (FPC&D) v2022
notation: 023.93

Other roundwood treated with preservatives, for uses n.e.c.
type: Concept
broader: Other roundwood treated with preservatives
definition: Roundwood treated with preservatives, other than poles, pilings and posts.
in scheme: Forest Products Classification and Definitions (FPC&D) v2022
notation: 023.99

Roughly trimmed wood
type: Concept
broader: WOOD SIMPLY WORKED OR PROCESSED
definition: It includes: Hoopwood; split poles; piles, pickets and stakes of wood, pointed but not sawn lengthwise; wooden sticks, roughly trimmed but not turned, bent or otherwise worked, suitable for the manufacture of walking sticks, umbrellas, tool handles or the like; chipwood and the like. It includes also wood shavings, which are used in the manufacture of vinegar or for the clarification of liquids.
in scheme: Forest Products Classification and Definitions (FPC&D) v2022
narrower: Other roughly trimmed wood
narrower: Roughly trimmed wood, coniferous
notation: 024.

Roughly trimmed wood, coniferous
type: Concept
broader: Roughly trimmed wood
definition: It includes: Hoopwood; split poles; piles, pickets and stakes of wood, pointed but not sawn lengthwise; wooden sticks, roughly trimmed but not turned, bent or otherwise worked, suitable for the manufacture of walking sticks, umbrellas, tool handles or the like; chipwood and the like. It includes also wood shavings, which are used in the manufacture of vinegar or for the clarification of liquids.
in scheme: Forest Products Classification and Definitions (FPC&D) v2022
narrower: Roughly trimmed wood, coniferous, wooden sticks roughly trimmed
narrower: Roughly trimmed wood, coniferous, n.e.c.
narrower: Roughly trimmed wood, coniferous, hoopwood
narrower: Roughly trimmed wood, coniferous, split poles
narrower: Roughly trimmed wood, coniferous, pointed piles, pickets and stakes
narrower: Roughly trimmed wood, coniferous, chipwood
notation: 024.1

Roughly trimmed wood, coniferous, hoopwood
type: Concept
broader: Roughly trimmed wood, coniferous
definition: Hoopwood cover split rods of willow, hazel, birch, etc., which are used in the manufacture of barrel hoops, hurdles, etc.
in scheme: Forest Products Classification and Definitions (FPC&D) v2022
notation: 024.11

Roughly trimmed wood, coniferous, split poles
type: Concept
broader: Roughly trimmed wood, coniferous
definition: This products incorporate stems or branches of trees split along the length. They are used as supports in horticulture, agriculture, for fencing, etc.
in scheme: Forest Products Classification and Definitions (FPC&D) v2022
notation: 024.12

Roughly trimmed wood, coniferous, pointed piles, pickets and stakes
type: Concept
broader: Roughly trimmed wood, coniferous
definition: This class cover round or split poles, pointed at the ends, which can be peeled or impregnated with preservative
in scheme: Forest Products Classification and Definitions (FPC&D) v2022
notation: 024.13

Roughly trimmed wood, coniferous, wooden sticks roughly trimmed
type: Concept
broader: Roughly trimmed wood, coniferous
definition: Products of different length and thickness which serve as a raw material for the next manufacture of walking sticks, whips, umbrellas, handles for tools, etc
in scheme: Forest Products Classification and Definitions (FPC&D) v2022
notation: 024.14

Roughly trimmed wood, coniferous, chipwood
type: Concept
broader: Roughly trimmed wood, coniferous
definition: This product encompasses flexible, narrow, thin and even strips of wood suitable for plaiting or for making sieves, chip-boxes, match-boxes, etc. It is produced by slicing, peeling or it is sawned.
in scheme: Forest Products Classification and Definitions (FPC&D) v2022
notation: 024.15

Roughly trimmed wood, coniferous, n.e.c.
type: Concept
broader: Roughly trimmed wood, coniferous
definition: These products also cover e.g. wood shavings, which are used in the manufacture of vinegar or for the clarification of liquids.
in scheme: Forest Products Classification and Definitions (FPC&D) v2022
notation: 024.19

Other roughly trimmed wood
type: Concept
broader: Roughly trimmed wood
definition: It includes: Hoopwood; split poles; piles, pickets and stakes of wood, pointed but not sawn lengthwise; wooden sticks, roughly trimmed but not turned, bent or otherwise worked, suitable for the manufacture of walking sticks, umbrellas, tool handles or the like; chipwood and the like. It includes also wood shavings, which are used in the manufacture of vinegar or for the clarification of liquids.
in scheme: Forest Products Classification and Definitions (FPC&D) v2022
narrower: Other roughly trimmed wood, split poles
narrower: Other roughly trimmed wood, hoopwood
narrower: Other roughly trimmed wood, pointed piles, pickets and stakes
narrower: Other roughly trimmed wood, wooden sticks roughly trimmed
narrower: Other roughly trimmed wood, chipwood
narrower: Other roughly trimmed wood, n.e.c.
notation: 024.9

Other roughly trimmed wood, hoopwood
type: Concept
broader: Other roughly trimmed wood
definition: Hoopwood cover split rods of willow, hazel, birch, etc., which are used in the manufacture of barrel hoops, hurdles, etc.
in scheme: Forest Products Classification and Definitions (FPC&D) v2022
notation: 024.91

Other roughly trimmed wood, split poles
type: Concept
broader: Other roughly trimmed wood
definition: This products incorporate stems or branches of trees split along the length. They are used as supports in horticulture, agriculture, for fencing, etc.
in scheme: Forest Products Classification and Definitions (FPC&D) v2022
notation: 024.92

Other roughly trimmed wood, pointed piles, pickets and stakes
type: Concept
broader: Other roughly trimmed wood
definition: This class cover round or split poles, pointed at the ends, which can be peeled or impregnated with preservative
in scheme: Forest Products Classification and Definitions (FPC&D) v2022
notation: 024.93

Other roughly trimmed wood, wooden sticks roughly trimmed
type: Concept
broader: Other roughly trimmed wood
definition: Products of different length and thickness which serve as a raw material for the next manufacture of walking sticks, whips, umbrellas, handles for tools, etc
in scheme: Forest Products Classification and Definitions (FPC&D) v2022
notation: 024.94

Other roughly trimmed wood, chipwood
type: Concept
broader: Other roughly trimmed wood
definition: This product encompasses flexible, narrow, thin and even strips of wood suitable for plaiting or for making sieves, chip-boxes, match-boxes, etc. It is produced by slicing, peeling or it is sawned.
in scheme: Forest Products Classification and Definitions (FPC&D) v2022
notation: 024.95

Other roughly trimmed wood, n.e.c.
type: Concept
broader: Other roughly trimmed wood
definition: These products also cover e.g. wood shavings, which are used in the manufacture of vinegar or for the clarification of liquids.
in scheme: Forest Products Classification and Definitions (FPC&D) v2022
notation: 024.99

Wood wool
type: Concept
broader: WOOD SIMPLY WORKED OR PROCESSED
definition: Wood wool is a product consists of wood slivers, curled or twisted, which have regular size, thickness and length. It is cut from logs (poplar, coniferous tree species) and is mainly used in packaging, for cooling pads in home evaporative cooling systems known as swamp coolers, for erosion control mats, and as a raw material for the production of other products such as bonded wood wool boards and used as stuffing for stuffed animals.
in scheme: Forest Products Classification and Definitions (FPC&D) v2022
narrower: Wood wool, coniferous
narrower: Other wood wool
notation: 025.

Wood wool, coniferous
type: Concept
broader: Wood wool
definition: Wood wool is a product consists of wood slivers, curled or twisted, which have regular size, thickness and length. It is cut from logs (poplar, coniferous tree species) and is mainly used in packaging, for cooling pads in home evaporative cooling systems known as swamp coolers, for erosion control mats, and as a raw material for the production of other products such as bonded wood wool boards and used as stuffing for stuffed animals.
in scheme: Forest Products Classification and Definitions (FPC&D) v2022
notation: 025.1

Other wood wool
type: Concept
broader: Wood wool
definition: Wood wool is a product consists of wood slivers, curled or twisted, which have regular size, thickness and length. It is cut from logs (poplar, coniferous tree species) and is mainly used in packaging, for cooling pads in home evaporative cooling systems known as swamp coolers, for erosion control mats, and as a raw material for the production of other products such as bonded wood wool boards and used as stuffing for stuffed animals.
in scheme: Forest Products Classification and Definitions (FPC&D) v2022
notation: 025.9

Wood flour
type: Concept
broader: WOOD SIMPLY WORKED OR PROCESSED
definition: Wood flour is finely pulverized wood that has a consistency fairly equal to sand or sawdust, but can vary considerably, with particles ranging in size from a fine powder to roughly the size of a grain of rice. It is commonly used as a filler in thermosetting resins such as bakelite, and in linoleum floor coverings. Wood flour is also the main ingredient in wood-plastic composite products such as decks and roofs.
in scheme: Forest Products Classification and Definitions (FPC&D) v2022
narrower: Wood flour, coniferous
narrower: Other wood flour
notation: 026.

Wood flour, coniferous
type: Concept
broader: Wood flour
definition: Wood flour is finely pulverized wood that has a consistency fairly equal to sand or sawdust, but can vary considerably, with particles ranging in size from a fine powder to roughly the size of a grain of rice. It is commonly used as a filler in thermosetting resins such as bakelite, and in linoleum floor coverings. Wood flour is also the main ingredient in wood-plastic composite products such as decks and roofs.
in scheme: Forest Products Classification and Definitions (FPC&D) v2022
notation: 026.1

Other wood flour
type: Concept
broader: Wood flour
definition: Wood flour is finely pulverized wood that has a consistency fairly equal to sand or sawdust, but can vary considerably, with particles ranging in size from a fine powder to roughly the size of a grain of rice. It is commonly used as a filler in thermosetting resins such as bakelite, and in linoleum floor coverings. Wood flour is also the main ingredient in wood-plastic composite products such as decks and roofs.
in scheme: Forest Products Classification and Definitions (FPC&D) v2022
notation: 026.9

Wood fuel simply worked
type: Concept
broader: WOOD SIMPLY WORKED OR PROCESSED
definition: Fuel wood, in logs, in billets, in twigs, in faggots or in similar forms.
in scheme: Forest Products Classification and Definitions (FPC&D) v2022
narrower: Wood fuel simply worked, coniferous
narrower: Other wood fuel simply worked
notation: 027.

Wood fuel simply worked, coniferous
type: Concept
broader: Wood fuel simply worked
definition: N.A.
in scheme: Forest Products Classification and Definitions (FPC&D) v2022
narrower: Wood fuel simply worked, coniferous, split (firewood)
narrower: Wood fuel simply worked, coniferous, n.e.c.
notation: 027.1

Wood fuel simply worked, coniferous, split (firewood)
type: Concept
broader: Wood fuel simply worked, coniferous
definition: Split logs or billets.
in scheme: Forest Products Classification and Definitions (FPC&D) v2022
notation: 027.11

Wood fuel simply worked, coniferous, n.e.c.
type: Concept
broader: Wood fuel simply worked, coniferous
definition: Twigs, faggots, rough sticks, tree stumps and roots.
in scheme: Forest Products Classification and Definitions (FPC&D) v2022
notation: 027.19

Other wood fuel simply worked
type: Concept
broader: Wood fuel simply worked
definition: N.A.
in scheme: Forest Products Classification and Definitions (FPC&D) v2022
narrower: Other wood fuel simply worked, split (firewood)
narrower: Other wood fuel simply worked, n.e.c.
notation: 027.9

Other wood fuel simply worked, split (firewood)
type: Concept
broader: Other wood fuel simply worked
definition: Split logs or billets.
in scheme: Forest Products Classification and Definitions (FPC&D) v2022
notation: 027.91

Other wood fuel simply worked, n.e.c.
type: Concept
broader: Other wood fuel simply worked
definition: Twigs, faggots, rough sticks, tree stumps and roots.
in scheme: Forest Products Classification and Definitions (FPC&D) v2022
notation: 027.99

WOOD CHIPS AND PARTICLES, RESIDUES AND RECOVERABLE WOOD PRODUCTS
type: Concept
definition: N.A.
in scheme: Forest Products Classification and Definitions (FPC&D) v2022
narrower: Wood residues (including wood for agglomerates)
narrower: Wood chips and particles
narrower: Recoverable wood products
notation: 03
top concept of: Forest Products Classification and Definitions (FPC&D) v2022

Wood residues (including wood for agglomerates)
type: Concept
broader: WOOD CHIPS AND PARTICLES, RESIDUES AND RECOVERABLE WOOD PRODUCTS
definition: Other wood processing co-products that has not been reduced to chips or particles and has not been agglomerated. These residues may often serve as raw material for the manufacture of certain forest products, notably pulp, particle board and fibreboard and may always be used as a source of energy.
in scheme: Forest Products Classification and Definitions (FPC&D) v2022
narrower: Other residues of wood processing, not of solid wood
narrower: Sawdust
narrower: Bark removed during processing
narrower: Solid wood processing residues
narrower: Shavings
notation: 031.

Solid wood processing residues
type: Concept
broader: Wood residues (including wood for agglomerates)
definition: Pieces of wood arising during processing, which have not been broken down into chips, sawdust, shavings or smaller particles. These pieces are suitable as raw material for the manufacture of pulp, particle board, fibreboard, etc. This category includes for example sawmill rejects, slabs, edgings and trimmings, veneer log cores, veneer rejects, sawdust, residues from carpentry and joinery production, etc. Excluded are bark and contaminated residues.
in scheme: Forest Products Classification and Definitions (FPC&D) v2022
narrower: Solid wood processing residues, coniferous
narrower: Other solid wood processing residues
notation: 031.1

Solid wood processing residues, coniferous
type: Concept
broader: Solid wood processing residues
definition: Pieces of wood arising during processing, which have not been broken down into chips, sawdust, shavings or smaller particles. These pieces are suitable as raw material for the manufacture of pulp, particle board, fibreboard, etc. This category includes for example sawmill rejects, slabs, edgings and trimmings, veneer log cores, veneer rejects, sawdust, residues from carpentry and joinery production, etc. Excluded are bark and contaminated residues.
in scheme: Forest Products Classification and Definitions (FPC&D) v2022
narrower: Solid wood processing residues, coniferous, for fibreboard
narrower: Solid wood processing residues, coniferous, for uses n.e.c.
narrower: Solid wood processing residues, coniferous, for energy
narrower: Solid wood processing residues, coniferous, for pulp
narrower: Solid wood processing residues, coniferous, for particle board
notation: 031.11

Solid wood processing residues, coniferous, for pulp
type: Concept
broader: Solid wood processing residues, coniferous
definition: N.A.
in scheme: Forest Products Classification and Definitions (FPC&D) v2022
notation: 031.111

Solid wood processing residues, coniferous, for particle board
type: Concept
broader: Solid wood processing residues, coniferous
definition: N.A.
in scheme: Forest Products Classification and Definitions (FPC&D) v2022
notation: 031.112

Solid wood processing residues, coniferous, for fibreboard
type: Concept
broader: Solid wood processing residues, coniferous
definition: N.A.
in scheme: Forest Products Classification and Definitions (FPC&D) v2022
notation: 031.113

Solid wood processing residues, coniferous, for energy
type: Concept
broader: Solid wood processing residues, coniferous
definition: N.A.
in scheme: Forest Products Classification and Definitions (FPC&D) v2022
notation: 031.114

Solid wood processing residues, coniferous, for uses n.e.c.
type: Concept
broader: Solid wood processing residues, coniferous
definition: N.A.
in scheme: Forest Products Classification and Definitions (FPC&D) v2022
notation: 031.119

Other solid wood processing residues
type: Concept
broader: Solid wood processing residues
definition: Pieces of wood arising during processing, which have not been broken down into chips, sawdust, shavings or smaller particles. These pieces are suitable as raw material for the manufacture of pulp, particle board, fibreboard, etc. This category includes for example sawmill rejects, slabs, edgings and trimmings, veneer log cores, veneer rejects, sawdust, residues from carpentry and joinery production, etc. Excluded are bark and contaminated residues.
in scheme: Forest Products Classification and Definitions (FPC&D) v2022
narrower: Other solid wood processing residues, for uses n.e.c.
narrower: Other solid wood processing residues, for pulp
narrower: Other solid wood processing residues, for particle board
narrower: Other solid wood processing residues, for fibreboard
narrower: Other solid wood processing residues, for energy
notation: 031.19

Other solid wood processing residues, for pulp
type: Concept
broader: Other solid wood processing residues
definition: N.A.
in scheme: Forest Products Classification and Definitions (FPC&D) v2022
notation: 031.191

Other solid wood processing residues, for particle board
type: Concept
broader: Other solid wood processing residues
definition: N.A.
in scheme: Forest Products Classification and Definitions (FPC&D) v2022
notation: 031.192

Other solid wood processing residues, for fibreboard
type: Concept
broader: Other solid wood processing residues
definition: N.A.
in scheme: Forest Products Classification and Definitions (FPC&D) v2022
notation: 031.193

Other solid wood processing residues, for energy
type: Concept
broader: Other solid wood processing residues
definition: N.A.
in scheme: Forest Products Classification and Definitions (FPC&D) v2022
notation: 031.194

Other solid wood processing residues, for uses n.e.c.
type: Concept
broader: Other solid wood processing residues
definition: N.A.
in scheme: Forest Products Classification and Definitions (FPC&D) v2022
notation: 031.199

Sawdust
type: Concept
broader: Wood residues (including wood for agglomerates)
definition: Wood dust produced in the process of sawing.
in scheme: Forest Products Classification and Definitions (FPC&D) v2022
narrower: Other sawdust
narrower: Sawdust, coniferous
notation: 031.2

Sawdust, coniferous
type: Concept
broader: Sawdust
definition: Wood dust produced in the process of sawing.
in scheme: Forest Products Classification and Definitions (FPC&D) v2022
narrower: Sawdust, coniferous, for particle board
narrower: Sawdust, coniferous, for pulp
narrower: Sawdust, coniferous, for fibreboard
narrower: Sawdust, coniferous, for energy
narrower: Sawdust, coniferous, for uses n.e.c.
notation: 031.21

Sawdust, coniferous, for pulp
type: Concept
broader: Sawdust, coniferous
definition: N.A.
in scheme: Forest Products Classification and Definitions (FPC&D) v2022
notation: 031.211

Sawdust, coniferous, for particle board
type: Concept
broader: Sawdust, coniferous
definition: N.A.
in scheme: Forest Products Classification and Definitions (FPC&D) v2022
notation: 031.212

Sawdust, coniferous, for fibreboard
type: Concept
broader: Sawdust, coniferous
definition: N.A.
in scheme: Forest Products Classification and Definitions (FPC&D) v2022
notation: 031.213

Sawdust, coniferous, for energy
type: Concept
broader: Sawdust, coniferous
definition: N.A.
in scheme: Forest Products Classification and Definitions (FPC&D) v2022
notation: 031.214

Sawdust, coniferous, for uses n.e.c.
type: Concept
broader: Sawdust, coniferous
definition: N.A.
in scheme: Forest Products Classification and Definitions (FPC&D) v2022
notation: 031.219

Other sawdust
type: Concept
broader: Sawdust
definition: Wood dust produced in the process of sawing.
in scheme: Forest Products Classification and Definitions (FPC&D) v2022
narrower: Other sawdust, for pulp
narrower: Other sawdust, for particle board
narrower: Other sawdust, for fibreboard
narrower: Other sawdust, for energy
narrower: Other sawdust, for uses n.e.c.
notation: 031.29

Other sawdust, for pulp
type: Concept
broader: Other sawdust
definition: N.A.
in scheme: Forest Products Classification and Definitions (FPC&D) v2022
notation: 031.291

Other sawdust, for particle board
type: Concept
broader: Other sawdust
definition: N.A.
in scheme: Forest Products Classification and Definitions (FPC&D) v2022
notation: 031.292

Other sawdust, for fibreboard
type: Concept
broader: Other sawdust
definition: N.A.
in scheme: Forest Products Classification and Definitions (FPC&D) v2022
notation: 031.293

Other sawdust, for energy
type: Concept
broader: Other sawdust
definition: N.A.
in scheme: Forest Products Classification and Definitions (FPC&D) v2022
notation: 031.294

Other sawdust, for uses n.e.c.
type: Concept
broader: Other sawdust
definition: N.A.
in scheme: Forest Products Classification and Definitions (FPC&D) v2022
notation: 031.299

Shavings
type: Concept
broader: Wood residues (including wood for agglomerates)
definition: Long, thin pieces of wood, produced in planing operations.
in scheme: Forest Products Classification and Definitions (FPC&D) v2022
narrower: Shavings, coniferous
narrower: Other shavings
notation: 031.3

Shavings, coniferous
type: Concept
broader: Shavings
definition: Long, thin pieces of wood, produced in planing operations.
in scheme: Forest Products Classification and Definitions (FPC&D) v2022
narrower: Shavings, coniferous, for energy
narrower: Shavings, coniferous, for particle board
narrower: Shavings, coniferous, for uses n.e.c.
narrower: Shavings, coniferous, for pulp
narrower: Shavings, coniferous, for fibreboard
notation: 031.31

Shavings, coniferous, for pulp
type: Concept
broader: Shavings, coniferous
definition: N.A.
in scheme: Forest Products Classification and Definitions (FPC&D) v2022
notation: 031.311

Shavings, coniferous, for particle board
type: Concept
broader: Shavings, coniferous
definition: N.A.
in scheme: Forest Products Classification and Definitions (FPC&D) v2022
notation: 031.312

Shavings, coniferous, for fibreboard
type: Concept
broader: Shavings, coniferous
definition: N.A.
in scheme: Forest Products Classification and Definitions (FPC&D) v2022
notation: 031.313

Shavings, coniferous, for energy
type: Concept
broader: Shavings, coniferous
definition: N.A.
in scheme: Forest Products Classification and Definitions (FPC&D) v2022
notation: 031.314

Shavings, coniferous, for uses n.e.c.
type: Concept
broader: Shavings, coniferous
definition: N.A.
in scheme: Forest Products Classification and Definitions (FPC&D) v2022
notation: 031.319

Other shavings
type: Concept
broader: Shavings
definition: Long, thin pieces of wood, produced in planing operations.
in scheme: Forest Products Classification and Definitions (FPC&D) v2022
narrower: Other shavings, for pulp
narrower: Other shavings, for particle board
narrower: Other shavings, for fibreboard
narrower: Other shavings, for energy
narrower: Other shavings, for uses n.e.c.
notation: 031.39

Other shavings, for pulp
type: Concept
broader: Other shavings
definition: N.A.
in scheme: Forest Products Classification and Definitions (FPC&D) v2022
notation: 031.391

Other shavings, for particle board
type: Concept
broader: Other shavings
definition: N.A.
in scheme: Forest Products Classification and Definitions (FPC&D) v2022
notation: 031.392

Other shavings, for fibreboard
type: Concept
broader: Other shavings
definition: N.A.
in scheme: Forest Products Classification and Definitions (FPC&D) v2022
notation: 031.393

Other shavings, for energy
type: Concept
broader: Other shavings
definition: N.A.
in scheme: Forest Products Classification and Definitions (FPC&D) v2022
notation: 031.394

Other shavings, for uses n.e.c.
type: Concept
broader: Other shavings
definition: N.A.
in scheme: Forest Products Classification and Definitions (FPC&D) v2022
notation: 031.399

Bark removed during processing
type: Concept
broader: Wood residues (including wood for agglomerates)
definition: Bark, separated from the wood in the wood-processing industries.
in scheme: Forest Products Classification and Definitions (FPC&D) v2022
narrower: Other bark removed during processing
narrower: Bark removed during processing, coniferous
notation: 031.4

Bark removed during processing, coniferous
type: Concept
broader: Bark removed during processing
definition: Bark, separated from the wood in the wood-processing industries.
in scheme: Forest Products Classification and Definitions (FPC&D) v2022
narrower: Bark removed during processing, coniferous, for horticulture purposes
narrower: Bark removed during processing, coniferous, for energy
narrower: Bark removed during processing, coniferous, for uses n.e.c.
notation: 031.41

Bark removed during processing, coniferous, for horticulture purposes
type: Concept
broader: Bark removed during processing, coniferous
definition: N.A.
in scheme: Forest Products Classification and Definitions (FPC&D) v2022
notation: 031.411

Bark removed during processing, coniferous, for energy
type: Concept
broader: Bark removed during processing, coniferous
definition: N.A.
in scheme: Forest Products Classification and Definitions (FPC&D) v2022
notation: 031.412

Bark removed during processing, coniferous, for uses n.e.c.
type: Concept
broader: Bark removed during processing, coniferous
definition: N.A.
in scheme: Forest Products Classification and Definitions (FPC&D) v2022
notation: 031.419

Other bark removed during processing
type: Concept
broader: Bark removed during processing
definition: Bark, separated from the wood in the wood-processing industries.
in scheme: Forest Products Classification and Definitions (FPC&D) v2022
narrower: Other bark removed during processing, for horticulture purposes
narrower: Other bark removed during processing, for energy
narrower: Other bark removed during processing ,for uses n.e.c.
notation: 031.49

Other bark removed during processing, for horticulture purposes
type: Concept
broader: Other bark removed during processing
definition: N.A.
in scheme: Forest Products Classification and Definitions (FPC&D) v2022
notation: 031.491

Other bark removed during processing, for energy
type: Concept
broader: Other bark removed during processing
definition: N.A.
in scheme: Forest Products Classification and Definitions (FPC&D) v2022
notation: 031.492

Other bark removed during processing ,for uses n.e.c.
type: Concept
broader: Other bark removed during processing
definition: N.A.
in scheme: Forest Products Classification and Definitions (FPC&D) v2022
notation: 031.499

Other residues of wood processing, not of solid wood
type: Concept
broader: Wood residues (including wood for agglomerates)
definition: This item includes notably sander dust and contaminated process residues.
in scheme: Forest Products Classification and Definitions (FPC&D) v2022
narrower: Other residues of wood processing, not of solid wood, coniferous
narrower: Other residues of wood processing, not of solid wood n.e.c.
notation: 031.9

Other residues of wood processing, not of solid wood, coniferous
type: Concept
broader: Other residues of wood processing, not of solid wood
definition: This item includes notably sander dust and contaminated process residues.
in scheme: Forest Products Classification and Definitions (FPC&D) v2022
narrower: Other residues of wood processing, not of solid wood, coniferous, for energy
narrower: Other residues of wood processing, not of solid wood, coniferous, for uses n.e.c.
notation: 031.91

Other residues of wood processing, not of solid wood, coniferous, for energy
type: Concept
broader: Other residues of wood processing, not of solid wood, coniferous
definition: N.A.
in scheme: Forest Products Classification and Definitions (FPC&D) v2022
notation: 031.911

Other residues of wood processing, not of solid wood, coniferous, for uses n.e.c.
type: Concept
broader: Other residues of wood processing, not of solid wood, coniferous
definition: N.A.
in scheme: Forest Products Classification and Definitions (FPC&D) v2022
notation: 031.919

Other residues of wood processing, not of solid wood n.e.c.
type: Concept
broader: Other residues of wood processing, not of solid wood
definition: This item includes notably sander dust and contaminated process residues.
in scheme: Forest Products Classification and Definitions (FPC&D) v2022
narrower: Other residues of wood processing, not of solid wood n.e.c., for energy
narrower: Other residues of wood processing, not of solid wood n.e.c., for other uses
notation: 031.99

Other residues of wood processing, not of solid wood n.e.c., for energy
type: Concept
broader: Other residues of wood processing, not of solid wood n.e.c.
definition: N.A.
in scheme: Forest Products Classification and Definitions (FPC&D) v2022
notation: 031.991

Other residues of wood processing, not of solid wood n.e.c., for other uses
type: Concept
broader: Other residues of wood processing, not of solid wood n.e.c.
definition: N.A.
in scheme: Forest Products Classification and Definitions (FPC&D) v2022
notation: 031.999

Wood chips and particles
type: Concept
broader: WOOD CHIPS AND PARTICLES, RESIDUES AND RECOVERABLE WOOD PRODUCTS
definition: Wood, which has been deliberately reduced to chips (flat, rigid and roughly squared), particles (thin and flexible), flakes, etc. from wood in the rough, processing residues or recovered wood products and has not been agglomerated. Wood chips and particles are used for producing cellulose pulp by mechanical means, by chemical means or by combining mechanical and chemical means, for the manufacture of fibreboard or particle board, for energy or for other purposes. The specification of the chips and particles may vary in respect to dimensions and quality according to location and end-use. The pieces are in forms ranging from flat, rigid and roughly squared chips down to small, thin flexible particles.
in scheme: Forest Products Classification and Definitions (FPC&D) v2022
narrower: Wood chips and particles from wood processing
narrower: Wood chips and particles from recovered wood products
narrower: Wood chips and particles from wood in the rough
notation: 032.

Wood chips and particles from wood in the rough
type: Concept
broader: Wood chips and particles
definition: Wood, which has been deliberately reduced to chips, particles, flakes, etc. directly from wood in the rough, not during the processing of wood.
in scheme: Forest Products Classification and Definitions (FPC&D) v2022
narrower: Other wood chips and particles from wood in the rough
narrower: Wood chips and particles from wood in the rough, coniferous
notation: 032.1

Wood chips and particles from wood in the rough, coniferous
type: Concept
broader: Wood chips and particles from wood in the rough
definition: Wood, which has been deliberately reduced to chips, particles, flakes, etc. directly from wood in the rough, not during the processing of wood.
in scheme: Forest Products Classification and Definitions (FPC&D) v2022
narrower: Wood chips and particles from wood in the rough, coniferous, for energy
narrower: Wood chips and particles from wood in the rough, coniferous, for pulp
narrower: Wood chips and particles from wood in the rough, coniferous, for uses n.e.c.
narrower: Wood chips and particles from wood in the rough, coniferous, for fibreboard
narrower: Wood chips and particles from wood in the rough, coniferous, for particle board
notation: 032.11

Wood chips and particles from wood in the rough, coniferous, for pulp
type: Concept
broader: Wood chips and particles from wood in the rough, coniferous
definition: N.A.
in scheme: Forest Products Classification and Definitions (FPC&D) v2022
notation: 032.111

Wood chips and particles from wood in the rough, coniferous, for particle board
type: Concept
broader: Wood chips and particles from wood in the rough, coniferous
definition: N.A.
in scheme: Forest Products Classification and Definitions (FPC&D) v2022
notation: 032.112

Wood chips and particles from wood in the rough, coniferous, for fibreboard
type: Concept
broader: Wood chips and particles from wood in the rough, coniferous
definition: N.A.
in scheme: Forest Products Classification and Definitions (FPC&D) v2022
notation: 032.113

Wood chips and particles from wood in the rough, coniferous, for energy
type: Concept
broader: Wood chips and particles from wood in the rough, coniferous
definition: N.A.
in scheme: Forest Products Classification and Definitions (FPC&D) v2022
notation: 032.114

Wood chips and particles from wood in the rough, coniferous, for uses n.e.c.
type: Concept
broader: Wood chips and particles from wood in the rough, coniferous
definition: N.A.
in scheme: Forest Products Classification and Definitions (FPC&D) v2022
notation: 032.119

Other wood chips and particles from wood in the rough
type: Concept
broader: Wood chips and particles from wood in the rough
definition: Wood, which has been deliberately reduced to chips, particles, flakes, etc. directly from wood in the rough, not during the processing of wood.
in scheme: Forest Products Classification and Definitions (FPC&D) v2022
narrower: Other wood chips and particles from wood in the rough, for pulp
narrower: Other wood chips and particles from wood in the rough, for uses n.e.c.
narrower: Other wood chips and particles from wood in the rough, for particle board
narrower: Other wood chips and particles from wood in the rough, for fibreboard
narrower: Other wood chips and particles from wood in the rough, for energy
notation: 032.19

Other wood chips and particles from wood in the rough, for pulp
type: Concept
broader: Other wood chips and particles from wood in the rough
definition: N.A.
in scheme: Forest Products Classification and Definitions (FPC&D) v2022
notation: 032.191

Other wood chips and particles from wood in the rough, for particle board
type: Concept
broader: Other wood chips and particles from wood in the rough
definition: N.A.
in scheme: Forest Products Classification and Definitions (FPC&D) v2022
notation: 032.192

Other wood chips and particles from wood in the rough, for fibreboard
type: Concept
broader: Other wood chips and particles from wood in the rough
definition: N.A.
in scheme: Forest Products Classification and Definitions (FPC&D) v2022
notation: 032.193

Other wood chips and particles from wood in the rough, for energy
type: Concept
broader: Other wood chips and particles from wood in the rough
definition: N.A.
in scheme: Forest Products Classification and Definitions (FPC&D) v2022
notation: 032.194

Other wood chips and particles from wood in the rough, for uses n.e.c.
type: Concept
broader: Other wood chips and particles from wood in the rough
definition: N.A.
in scheme: Forest Products Classification and Definitions (FPC&D) v2022
notation: 032.199

Wood chips and particles from wood processing
type: Concept
broader: Wood chips and particles
definition: Wood, which has been deliberately reduced to chips, particles, flakes, etc. during the processing of wood.
in scheme: Forest Products Classification and Definitions (FPC&D) v2022
narrower: Other wood chips and particles from wood processing
narrower: Wood chips and particles from wood processing, coniferous
notation: 032.2

Wood chips and particles from wood processing, coniferous
type: Concept
broader: Wood chips and particles from wood processing
definition: Wood, which has been deliberately reduced to chips, particles, flakes, etc. during the processing of wood.
in scheme: Forest Products Classification and Definitions (FPC&D) v2022
narrower: Wood chips and particles from wood processing, coniferous, for pulp
narrower: Wood chips and particles from wood processing, coniferous, for particle board
narrower: Wood chips and particles from wood processing, coniferous, for fibreboard
narrower: Wood chips and particles from wood processing, coniferous, for energy
narrower: Wood chips and particles from wood processing, coniferous, for uses n.e.c.
notation: 032.21

Wood chips and particles from wood processing, coniferous, for pulp
type: Concept
broader: Wood chips and particles from wood processing, coniferous
definition: N.A.
in scheme: Forest Products Classification and Definitions (FPC&D) v2022
notation: 032.211

Wood chips and particles from wood processing, coniferous, for particle board
type: Concept
broader: Wood chips and particles from wood processing, coniferous
definition: N.A.
in scheme: Forest Products Classification and Definitions (FPC&D) v2022
notation: 032.212

Wood chips and particles from wood processing, coniferous, for fibreboard
type: Concept
broader: Wood chips and particles from wood processing, coniferous
definition: N.A.
in scheme: Forest Products Classification and Definitions (FPC&D) v2022
notation: 032.213

Wood chips and particles from wood processing, coniferous, for energy
type: Concept
broader: Wood chips and particles from wood processing, coniferous
definition: N.A.
in scheme: Forest Products Classification and Definitions (FPC&D) v2022
notation: 032.214

Wood chips and particles from wood processing, coniferous, for uses n.e.c.
type: Concept
broader: Wood chips and particles from wood processing, coniferous
definition: N.A.
in scheme: Forest Products Classification and Definitions (FPC&D) v2022
notation: 032.219

Other wood chips and particles from wood processing
type: Concept
broader: Wood chips and particles from wood processing
definition: Wood, which has been deliberately reduced to chips, particles, flakes, etc. during the processing of wood.
in scheme: Forest Products Classification and Definitions (FPC&D) v2022
narrower: Other wood chips and particles from wood processing, for pulp
narrower: Other wood chips and particles from wood processing, for particle board
narrower: Other wood chips and particles from wood processing, for fibreboard
narrower: Other wood chips and particles from wood processing, for energy
narrower: Other wood chips and particles from wood processing, for uses n.e.c.
notation: 032.29

Other wood chips and particles from wood processing, for pulp
type: Concept
broader: Other wood chips and particles from wood processing
definition: N.A.
in scheme: Forest Products Classification and Definitions (FPC&D) v2022
notation: 032.291

Other wood chips and particles from wood processing, for particle board
type: Concept
broader: Other wood chips and particles from wood processing
definition: N.A.
in scheme: Forest Products Classification and Definitions (FPC&D) v2022
notation: 032.292

Other wood chips and particles from wood processing, for fibreboard
type: Concept
broader: Other wood chips and particles from wood processing
definition: N.A.
in scheme: Forest Products Classification and Definitions (FPC&D) v2022
notation: 032.293

Other wood chips and particles from wood processing, for energy
type: Concept
broader: Other wood chips and particles from wood processing
definition: N.A.
in scheme: Forest Products Classification and Definitions (FPC&D) v2022
notation: 032.294

Other wood chips and particles from wood processing, for uses n.e.c.
type: Concept
broader: Other wood chips and particles from wood processing
definition: N.A.
in scheme: Forest Products Classification and Definitions (FPC&D) v2022
notation: 032.299

Wood chips and particles from recovered wood products
type: Concept
broader: Wood chips and particles
definition: Wood, which has been deliberately reduced to chips, particles, flakes, etc. from products wholly or mostly of wood or wood-based panels, which are no longer used for their original purpose.
in scheme: Forest Products Classification and Definitions (FPC&D) v2022
narrower: Wood chips and particles from recovered wood products, coniferous
narrower: Other wood chips and particles from recovered wood products
notation: 032.3

Wood chips and particles from recovered wood products, coniferous
type: Concept
broader: Wood chips and particles from recovered wood products
definition: Wood, which has been deliberately reduced to chips, particles, flakes, etc. from products wholly or mostly of wood or wood-based panels, which are no longer used for their original purpose.
in scheme: Forest Products Classification and Definitions (FPC&D) v2022
narrower: Wood chips and particles from recovered wood products, coniferous, for pulp
narrower: Wood chips and particles from recovered wood products, coniferous, for particle board
narrower: Wood chips and particles from recovered wood products, coniferous, for fibreboard
narrower: Wood chips and particles from recovered wood products, coniferous, for energy
narrower: Wood chips and particles from recovered wood products, coniferous, for uses n.e.c.
notation: 032.31

Wood chips and particles from recovered wood products, coniferous, for pulp
type: Concept
broader: Wood chips and particles from recovered wood products, coniferous
definition: N.A.
in scheme: Forest Products Classification and Definitions (FPC&D) v2022
notation: 032.311

Wood chips and particles from recovered wood products, coniferous, for particle board
type: Concept
broader: Wood chips and particles from recovered wood products, coniferous
definition: N.A.
in scheme: Forest Products Classification and Definitions (FPC&D) v2022
notation: 032.312

Wood chips and particles from recovered wood products, coniferous, for fibreboard
type: Concept
broader: Wood chips and particles from recovered wood products, coniferous
definition: N.A.
in scheme: Forest Products Classification and Definitions (FPC&D) v2022
notation: 032.313

Wood chips and particles from recovered wood products, coniferous, for energy
type: Concept
broader: Wood chips and particles from recovered wood products, coniferous
definition: N.A.
in scheme: Forest Products Classification and Definitions (FPC&D) v2022
notation: 032.314

Wood chips and particles from recovered wood products, coniferous, for uses n.e.c.
type: Concept
broader: Wood chips and particles from recovered wood products, coniferous
definition: N.A.
in scheme: Forest Products Classification and Definitions (FPC&D) v2022
notation: 032.319

Other wood chips and particles from recovered wood products
type: Concept
broader: Wood chips and particles from recovered wood products
definition: Wood, which has been deliberately reduced to chips, particles, flakes, etc. from products wholly or mostly of wood or wood-based panels, which are no longer used for their original purpose.
in scheme: Forest Products Classification and Definitions (FPC&D) v2022
narrower: Other wood chips and particles from recovered wood products, for pulp
narrower: Other wood chips and particles from recovered wood products, for particle board
narrower: Other wood chips and particles from recovered wood products, for fibreboard
narrower: Other wood chips and particles from recovered wood products, for energy
narrower: Other wood chips and particles from recovered wood products, for uses n.e.c.
notation: 032.39

Other wood chips and particles from recovered wood products, for pulp
type: Concept
broader: Other wood chips and particles from recovered wood products
definition: N.A.
in scheme: Forest Products Classification and Definitions (FPC&D) v2022
notation: 032.391

Other wood chips and particles from recovered wood products, for particle board
type: Concept
broader: Other wood chips and particles from recovered wood products
definition: N.A.
in scheme: Forest Products Classification and Definitions (FPC&D) v2022
notation: 032.392

Other wood chips and particles from recovered wood products, for fibreboard
type: Concept
broader: Other wood chips and particles from recovered wood products
definition: N.A.
in scheme: Forest Products Classification and Definitions (FPC&D) v2022
notation: 032.393

Other wood chips and particles from recovered wood products, for energy
type: Concept
broader: Other wood chips and particles from recovered wood products
definition: N.A.
in scheme: Forest Products Classification and Definitions (FPC&D) v2022
notation: 032.394

Other wood chips and particles from recovered wood products, for uses n.e.c.
type: Concept
broader: Other wood chips and particles from recovered wood products
definition: N.A.
in scheme: Forest Products Classification and Definitions (FPC&D) v2022
notation: 032.399

Recoverable wood products
type: Concept
broader: WOOD CHIPS AND PARTICLES, RESIDUES AND RECOVERABLE WOOD PRODUCTS
definition: Products wholly or mostly of wood or wood-based panels, which are no longer used for their original purpose and which could be used as a source of raw material or energy.
in scheme: Forest Products Classification and Definitions (FPC&D) v2022
narrower: Contaminated recoverable wood products
narrower: Uncontaminated recoverable wood products
notation: 033.

Uncontaminated recoverable wood products
type: Concept
broader: Recoverable wood products
definition: The recoverable wood products have not been contaminated (e.g. by impregnation, gluing, coating, painting or nailing) to such an extent that they are unsuitable as raw material for pulp particle board or fibreboard. Examples are some pallets and wood packing cases.
in scheme: Forest Products Classification and Definitions (FPC&D) v2022
narrower: Other uncontaminated recoverable wood products
narrower: Uncontaminated recoverable wood products, coniferous
notation: 033.1

Uncontaminated recoverable wood products, coniferous
type: Concept
broader: Uncontaminated recoverable wood products
definition: The recoverable wood products have not been contaminated (e.g. by impregnation, gluing, coating, painting or nailing) to such an extent that they are unsuitable as raw material for pulp particle board or fibreboard. Examples are some pallets and wood packing cases.
in scheme: Forest Products Classification and Definitions (FPC&D) v2022
narrower: Uncontaminated recoverable wood products, coniferous, for pulp
narrower: Uncontaminated recoverable wood products, coniferous, for particle board
narrower: Uncontaminated recoverable wood products, coniferous, for fibreboard
narrower: Uncontaminated recoverable wood products, coniferous, for energy
narrower: Uncontaminated recoverable wood products, coniferous, for uses n.e.c.
notation: 033.11

Uncontaminated recoverable wood products, coniferous, for pulp
type: Concept
broader: Uncontaminated recoverable wood products, coniferous
definition: N.A.
in scheme: Forest Products Classification and Definitions (FPC&D) v2022
notation: 033.111

Uncontaminated recoverable wood products, coniferous, for particle board
type: Concept
broader: Uncontaminated recoverable wood products, coniferous
definition: N.A.
in scheme: Forest Products Classification and Definitions (FPC&D) v2022
notation: 033.112

Uncontaminated recoverable wood products, coniferous, for fibreboard
type: Concept
broader: Uncontaminated recoverable wood products, coniferous
definition: N.A.
in scheme: Forest Products Classification and Definitions (FPC&D) v2022
notation: 033.113

Uncontaminated recoverable wood products, coniferous, for energy
type: Concept
broader: Uncontaminated recoverable wood products, coniferous
definition: N.A.
in scheme: Forest Products Classification and Definitions (FPC&D) v2022
notation: 033.114

Uncontaminated recoverable wood products, coniferous, for uses n.e.c.
type: Concept
broader: Uncontaminated recoverable wood products, coniferous
definition: N.A.
in scheme: Forest Products Classification and Definitions (FPC&D) v2022
notation: 033.119

Other uncontaminated recoverable wood products
type: Concept
broader: Uncontaminated recoverable wood products
definition: The recoverable wood products have not been contaminated (e.g. by impregnation, gluing, coating, painting or nailing) to such an extent that they are unsuitable as raw material for pulp particle board or fibreboard. Examples are some pallets and wood packing cases.
in scheme: Forest Products Classification and Definitions (FPC&D) v2022
narrower: Other uncontaminated recoverable wood products, for uses n.e.c.
narrower: Other uncontaminated recoverable wood products, for pulp
narrower: Other uncontaminated recoverable wood products, for particle board
narrower: Other uncontaminated recoverable wood products, for fibreboard
narrower: Other uncontaminated recoverable wood products, for energy
notation: 033.19

Other uncontaminated recoverable wood products, for pulp
type: Concept
broader: Other uncontaminated recoverable wood products
definition: N.A.
in scheme: Forest Products Classification and Definitions (FPC&D) v2022
notation: 033.191

Other uncontaminated recoverable wood products, for particle board
type: Concept
broader: Other uncontaminated recoverable wood products
definition: N.A.
in scheme: Forest Products Classification and Definitions (FPC&D) v2022
notation: 033.192

Other uncontaminated recoverable wood products, for fibreboard
type: Concept
broader: Other uncontaminated recoverable wood products
definition: N.A.
in scheme: Forest Products Classification and Definitions (FPC&D) v2022
notation: 033.193

Other uncontaminated recoverable wood products, for energy
type: Concept
broader: Other uncontaminated recoverable wood products
definition: N.A.
in scheme: Forest Products Classification and Definitions (FPC&D) v2022
notation: 033.194

Other uncontaminated recoverable wood products, for uses n.e.c.
type: Concept
broader: Other uncontaminated recoverable wood products
definition: N.A.
in scheme: Forest Products Classification and Definitions (FPC&D) v2022
notation: 033.199

Contaminated recoverable wood products
type: Concept
broader: Recoverable wood products
definition: The recoverable wood products have been contaminated (e.g. by impregnation, gluing, coating, painting or nailing) to such an extent that they are unsuitable as raw material for pulp particle board or fibreboard. They are usually only suitable as energy source.
in scheme: Forest Products Classification and Definitions (FPC&D) v2022
narrower: Contaminated recoverable wood products, coniferous
narrower: Other contaminated recoverable wood products
notation: 033.2

Contaminated recoverable wood products, coniferous
type: Concept
broader: Contaminated recoverable wood products
definition: The recoverable wood products have been contaminated (e.g. by impregnation, gluing, coating, painting or nailing) to such an extent that they are unsuitable as raw material for pulp particle board or fibreboard. They are usually only suitable as energy source.
in scheme: Forest Products Classification and Definitions (FPC&D) v2022
narrower: Contaminated recoverable wood products, coniferous, for uses n.e.c.
narrower: Contaminated recoverable wood products, coniferous, for energy
notation: 033.21

Contaminated recoverable wood products, coniferous, for energy
type: Concept
broader: Contaminated recoverable wood products, coniferous
definition: N.A.
in scheme: Forest Products Classification and Definitions (FPC&D) v2022
notation: 033.211

Contaminated recoverable wood products, coniferous, for uses n.e.c.
type: Concept
broader: Contaminated recoverable wood products, coniferous
definition: N.A.
in scheme: Forest Products Classification and Definitions (FPC&D) v2022
notation: 033.219

Other contaminated recoverable wood products
type: Concept
broader: Contaminated recoverable wood products
definition: The recoverable wood products have been contaminated (e.g. by impregnation, gluing, coating, painting or nailing) to such an extent that they are unsuitable as raw material for pulp particle board or fibreboard. They are usually only suitable as energy source.
in scheme: Forest Products Classification and Definitions (FPC&D) v2022
narrower: Other contaminated recoverable wood products, for energy
narrower: Other contaminated recoverable wood products, for uses n.e.c.
notation: 033.29

Other contaminated recoverable wood products, for energy
type: Concept
broader: Other contaminated recoverable wood products
definition: N.A.
in scheme: Forest Products Classification and Definitions (FPC&D) v2022
notation: 033.291

Other contaminated recoverable wood products, for uses n.e.c.
type: Concept
broader: Other contaminated recoverable wood products
definition: N.A.
in scheme: Forest Products Classification and Definitions (FPC&D) v2022
notation: 033.299

WOOD PELLETS AND OTHER AGGLOMERATES
type: Concept
definition: Agglomerates produced from co-products (such as cutter shavings, sawdust or chips) of the mechanical wood processing industry, furniture-making industry or other wood transformation activities.
in scheme: Forest Products Classification and Definitions (FPC&D) v2022
narrower: Wood pellets
narrower: Wood briquettes
narrower: Other agglomerates
notation: 04
top concept of: Forest Products Classification and Definitions (FPC&D) v2022

Wood pellets
type: Concept
broader: WOOD PELLETS AND OTHER AGGLOMERATES
definition: Agglomerates produced either directly by compression or by the addition of a binder in a proportion not exceeding 3% by weight. Such pellets are cylindrical, with a diameter not exceeding 25 mm and a length not exceeding 100 mm.
in scheme: Forest Products Classification and Definitions (FPC&D) v2022
narrower: Other wood pellets
narrower: Wood pellets, coniferous
notation: 041.

Wood pellets, coniferous
type: Concept
broader: Wood pellets
definition: Agglomerates produced either directly by compression or by the addition of a binder in a proportion not exceeding 3% by weight. Such pellets are cylindrical, with a diameter not exceeding 25 mm and a length not exceeding 100 mm.
in scheme: Forest Products Classification and Definitions (FPC&D) v2022
narrower: Wood pellets, coniferous, for energy
narrower: Wood pellets, coniferous, for uses n.e.c. (bedding, absorbents,…)
notation: 041.1

Wood pellets, coniferous, for energy
type: Concept
broader: Wood pellets, coniferous
definition: N.A.
in scheme: Forest Products Classification and Definitions (FPC&D) v2022
notation: 041.11

Wood pellets, coniferous, for uses n.e.c. (bedding, absorbents,…)
type: Concept
broader: Wood pellets, coniferous
definition: N.A.
in scheme: Forest Products Classification and Definitions (FPC&D) v2022
notation: 041.19

Other wood pellets
type: Concept
broader: Wood pellets
definition: Agglomerates produced either directly by compression or by the addition of a binder in a proportion not exceeding 3% by weight. Such pellets are cylindrical, with a diameter not exceeding 25 mm and a length not exceeding 100 mm.
in scheme: Forest Products Classification and Definitions (FPC&D) v2022
narrower: Other wood pellets, for energy
narrower: Other wood pellets, for uses n.e.c. (bedding, absorbents,…)
notation: 041.9

Other wood pellets, for energy
type: Concept
broader: Other wood pellets
definition: N.A.
in scheme: Forest Products Classification and Definitions (FPC&D) v2022
notation: 041.91

Other wood pellets, for uses n.e.c. (bedding, absorbents,…)
type: Concept
broader: Other wood pellets
definition: N.A.
in scheme: Forest Products Classification and Definitions (FPC&D) v2022
notation: 041.99

Wood briquettes
type: Concept
broader: WOOD PELLETS AND OTHER AGGLOMERATES
definition: Agglomerates produced either directly by compression or by the addition of a binder. Briquettes are cylindrical, with a diameter exceeding 25 mm (usually from 75 mm to 90 mm) and a length up to 300 mm.
in scheme: Forest Products Classification and Definitions (FPC&D) v2022
narrower: Wood briquettes, other
narrower: Wood briquettes, coniferous
notation: 042.

Wood briquettes, coniferous
type: Concept
broader: Wood briquettes
definition: Agglomerates produced either directly by compression or by the addition of a binder. Briquettes are cylindrical, with a diameter exceeding 25 mm (usually from 75 mm to 90 mm) and a length up to 300 mm.
in scheme: Forest Products Classification and Definitions (FPC&D) v2022
notation: 042.1

Other agglomerates
type: Concept
broader: WOOD PELLETS AND OTHER AGGLOMERATES
definition: Agglomerates other than wood pellets and wood briquettes, for example logs.
in scheme: Forest Products Classification and Definitions (FPC&D) v2022
narrower: Other agglomerates, coniferous
narrower: Other agglomerates n.e.c.
notation: 043.

Other agglomerates, coniferous
type: Concept
broader: Other agglomerates
definition: Agglomerates other than wood pellets and wood briquettes, for example logs.
in scheme: Forest Products Classification and Definitions (FPC&D) v2022
narrower: Other agglomerates, coniferous, for energy
narrower: Other agglomerates, coniferous, for uses n.e.c.
notation: 043.1

Other agglomerates, coniferous, for energy
type: Concept
broader: Other agglomerates, coniferous
definition: N.A.
in scheme: Forest Products Classification and Definitions (FPC&D) v2022
notation: 043.11

Other agglomerates, coniferous, for uses n.e.c.
type: Concept
broader: Other agglomerates, coniferous
definition: N.A.
in scheme: Forest Products Classification and Definitions (FPC&D) v2022
notation: 043.19

Other agglomerates n.e.c.
type: Concept
broader: Other agglomerates
definition: Agglomerates other than wood pellets and wood briquettes, for example logs.
in scheme: Forest Products Classification and Definitions (FPC&D) v2022
narrower: Other agglomerates n.e.c., for energy
narrower: Other agglomerates n.e.c., for other uses
notation: 043.9

Other agglomerates n.e.c., for energy
type: Concept
broader: Other agglomerates n.e.c.
definition: N.A.
in scheme: Forest Products Classification and Definitions (FPC&D) v2022
notation: 043.91

Other agglomerates n.e.c., for other uses
type: Concept
broader: Other agglomerates n.e.c.
definition: N.A.
in scheme: Forest Products Classification and Definitions (FPC&D) v2022
notation: 043.99

SAWNWOOD
type: Concept
definition: Wood that has been produced from both domestic and imported roundwood, either by sawing lengthways or by a profile-chipping process and that exceeds 6 mm in thickness. Both sawn and hewn sleepers are included. It includes planks, beams, joists, boards, rafters, scantlings, laths, boxboards and "lumber", etc., in the following forms: unplaned, planed, etc. It excludes wooden flooring, mouldings (sawnwood continuously shaped along any of its edges or faces, like tongued, grooved, rebated, V-jointed, beaded, moulded, rounded or the like) and sawnwood produced by resawing previously sawn pieces.
in scheme: Forest Products Classification and Definitions (FPC&D) v2022
narrower: Coniferous, sawnwood and sleepers
narrower: Tropical non-coniferous, sawnwood and sleepers
narrower: Other non-coniferous, sawnwood and sleepers
notation: 05
top concept of: Forest Products Classification and Definitions (FPC&D) v2022

Coniferous, sawnwood and sleepers
type: Concept
broader: SAWNWOOD
definition: N.A.
in scheme: Forest Products Classification and Definitions (FPC&D) v2022
narrower: Coniferous, sleepers
narrower: Coniferous, sawnwood rough
narrower: Coniferous, sawnwood planed
narrower: Coniferous, other
notation: 051.

Coniferous, sleepers
type: Concept
broader: Coniferous, sawnwood and sleepers
definition: Railway or tramway sleepers are pieces of unplaned wood, of more or less rectangular section of the kind commonly used to support railway or tramway track. There are also included switch ties, which are longer than sleepers, and bridge ties, which are wider and thicker and usually longer than sleepers. It includes sawn sleepers, hewn sleepers, untreated and treated sleepers
in scheme: Forest Products Classification and Definitions (FPC&D) v2022
narrower: Coniferous, sleepers, treated or impregnated
narrower: Coniferous, sleepers, n.e.c.
notation: 051.1

Coniferous, sleepers, treated or impregnated
type: Concept
broader: Coniferous, sleepers
definition: Sleepers may be surface treated with insecticides, fungicides or impregnated with creosote or other substances for long-term preservation.
in scheme: Forest Products Classification and Definitions (FPC&D) v2022
notation: 051.11

Coniferous, sleepers, n.e.c.
type: Concept
broader: Coniferous, sleepers
definition: Sleepers which are not treated with insecticides or fungicides nor impregnated.
in scheme: Forest Products Classification and Definitions (FPC&D) v2022
notation: 051.19

Coniferous, sawnwood rough
type: Concept
broader: Coniferous, sawnwood and sleepers
definition: Wood sawn or chipped lengthwise, not planed, sanded or finger-jointed. It may be green (undried) or dried. It excludes sawn and hewn railway sleepers, wood shingles and sawn veneer sheets.
in scheme: Forest Products Classification and Definitions (FPC&D) v2022
narrower: Coniferous, sawnwood rough, treated or impregnated
narrower: Coniferous, sawnwood rough, n.e.c.
notation: 051.2

Coniferous, sawnwood rough, treated or impregnated
type: Concept
broader: Coniferous, sawnwood rough
definition: Wood sawn or chipped lengthwise, not planed, sanded or finger-jointed and which was treated with insecticides or fungicides for the purpose of protection. For long-term preservation they can be impregnated with creosote or other substances.
in scheme: Forest Products Classification and Definitions (FPC&D) v2022
notation: 051.21

Coniferous, sawnwood rough, n.e.c.
type: Concept
broader: Coniferous, sawnwood rough
definition: Wood sawn or chipped lengthwise, not planed, sanded or finger-jointed and which was not treated for the purpose of protection.
in scheme: Forest Products Classification and Definitions (FPC&D) v2022
notation: 051.29

Coniferous, sawnwood planed
type: Concept
broader: Coniferous, sawnwood and sleepers
definition: Wood sawn or chipped lengthwise, and planed, sanded or finger-jointed.
in scheme: Forest Products Classification and Definitions (FPC&D) v2022
narrower: Coniferous, sawnwood planed, treated or impregnated
narrower: Coniferous, sawnwood planed, n.e.c.
notation: 051.3

Coniferous, sawnwood planed, treated or impregnated
type: Concept
broader: Coniferous, sawnwood planed
definition: Wood sawn or chipped lengthwise, and planed, sanded or finger-jointed, which was not kiln- or air-dried but was treated with insecticides or fungicides for the purpose of protection. For long-term preservation they can be impregnated with creosote or other substances.
in scheme: Forest Products Classification and Definitions (FPC&D) v2022
notation: 051.31

Coniferous, sawnwood planed, n.e.c.
type: Concept
broader: Coniferous, sawnwood planed
definition: Wood sawn or chipped lengthwise, and planed, sanded or finger-jointed, which was kiln- or air-dried but not treated for the purpose of protection.
in scheme: Forest Products Classification and Definitions (FPC&D) v2022
notation: 051.39

Coniferous, other
type: Concept
broader: Coniferous, sawnwood and sleepers
definition: N.A.
in scheme: Forest Products Classification and Definitions (FPC&D) v2022
notation: 051.9

Tropical non-coniferous, sawnwood and sleepers
type: Concept
broader: SAWNWOOD
definition: N.A.
in scheme: Forest Products Classification and Definitions (FPC&D) v2022
narrower: Tropical non-coniferous, sleepers
narrower: Tropical non-coniferous, sawnwood rough
narrower: Tropical non-coniferous, sawnwood planed
narrower: Tropical non-coniferous, other
notation: 052.

Tropical non-coniferous, sleepers
type: Concept
broader: Tropical non-coniferous, sawnwood and sleepers
definition: Railway or tramway sleepers are pieces of unplaned wood, of more or less rectangular section of the kind commonly used to support railway or tramway track. There are also included switch ties, which are longer than sleepers, and bridge ties, which are wider and thicker and usually longer than sleepers. It includes sawn sleepers, hewn sleepers, untreated and treated sleepers
in scheme: Forest Products Classification and Definitions (FPC&D) v2022
narrower: Tropical non-coniferous, sleepers, treated or impregnated
narrower: Tropical non-coniferous, sleepers, n.e.c.
notation: 052.1

Tropical non-coniferous, sleepers, treated or impregnated
type: Concept
broader: Tropical non-coniferous, sleepers
definition: Sleepers may be surface treated with insecticides, fungicides or impregnated with creosote or other substances for long-term preservation.
in scheme: Forest Products Classification and Definitions (FPC&D) v2022
notation: 052.11

Tropical non-coniferous, sleepers, n.e.c.
type: Concept
broader: Tropical non-coniferous, sleepers
definition: Sleepers which are not treated with insecticides or fungicides nor impregnated.
in scheme: Forest Products Classification and Definitions (FPC&D) v2022
notation: 052.19

Tropical non-coniferous, sawnwood rough
type: Concept
broader: Tropical non-coniferous, sawnwood and sleepers
definition: Wood sawn or chipped lengthwise, not planed, sanded or finger-jointed. It may be green (undried) or dried. It excludes sawn and hewn railway sleepers, wood shingles and sawn veneer sheets.
in scheme: Forest Products Classification and Definitions (FPC&D) v2022
narrower: Tropical non-coniferous, sawnwood rough, treated or impregnated
narrower: Tropical non-coniferous, sawnwood rough, n.e.c.
notation: 052.2

Tropical non-coniferous, sawnwood rough, treated or impregnated
type: Concept
broader: Tropical non-coniferous, sawnwood rough
definition: Wood sawn or chipped lengthwise, not planed, sanded or finger-jointed and which was treated with insecticides or fungicides for the purpose of protection. For long-term preservation they can be impregnated with creosote or other substances.
in scheme: Forest Products Classification and Definitions (FPC&D) v2022
notation: 052.21

Tropical non-coniferous, sawnwood rough, n.e.c.
type: Concept
broader: Tropical non-coniferous, sawnwood rough
definition: Wood sawn or chipped lengthwise, not planed, sanded or finger-jointed and which was not treated for the purpose of protection.
in scheme: Forest Products Classification and Definitions (FPC&D) v2022
notation: 052.29

Tropical non-coniferous, sawnwood planed
type: Concept
broader: Tropical non-coniferous, sawnwood and sleepers
definition: Wood sawn or chipped lengthwise, and planed, sanded or finger-jointed.
in scheme: Forest Products Classification and Definitions (FPC&D) v2022
narrower: Tropical non-coniferous, sawnwood planed, n.e.c.
narrower: Tropical non-coniferous, sawnwood planed, treated or impregnated
notation: 052.3

Tropical non-coniferous, sawnwood planed, treated or impregnated
type: Concept
broader: Tropical non-coniferous, sawnwood planed
definition: Wood sawn or chipped lengthwise, and planed, sanded or finger-jointed, which was not kiln- or air-dried but was treated with insecticides or fungicides for the purpose of protection. For long-term preservation they can be impregnated with creosote or other substances.
in scheme: Forest Products Classification and Definitions (FPC&D) v2022
notation: 052.31

Tropical non-coniferous, sawnwood planed, n.e.c.
type: Concept
broader: Tropical non-coniferous, sawnwood planed
definition: Wood sawn or chipped lengthwise, and planed, sanded or finger-jointed, which was kiln- or air-dried but not treated for the purpose of protection.
in scheme: Forest Products Classification and Definitions (FPC&D) v2022
notation: 052.39

Tropical non-coniferous, other
type: Concept
broader: Tropical non-coniferous, sawnwood and sleepers
definition: N.A.
in scheme: Forest Products Classification and Definitions (FPC&D) v2022
notation: 052.9

Other non-coniferous, sawnwood and sleepers
type: Concept
broader: SAWNWOOD
definition: N.A.
in scheme: Forest Products Classification and Definitions (FPC&D) v2022
narrower: Other non-coniferous, sleepers
narrower: Other non-coniferous, sawnwood rough
narrower: Other non-coniferous n.e.c.
narrower: Other non-coniferous, sawnwood planed
notation: 053.

Other non-coniferous, sleepers
type: Concept
broader: Other non-coniferous, sawnwood and sleepers
definition: Railway or tramway sleepers are pieces of unplaned wood, of more or less rectangular section of the kind commonly used to support railway or tramway track. There are also included switch ties, which are longer than sleepers, and bridge ties, which are wider and thicker and usually longer than sleepers. It includes sawn sleepers, hewn sleepers, untreated and treated sleepers
in scheme: Forest Products Classification and Definitions (FPC&D) v2022
narrower: Other non-coniferous, sleepers, other
narrower: Other non-coniferous, sleepers, treated or impregnated
notation: 053.1

Other non-coniferous, sleepers, treated or impregnated
type: Concept
broader: Other non-coniferous, sleepers
definition: Sleepers may be surface treated with insecticides, fungicides or impregnated with creosote or other substances for long-term preservation.
in scheme: Forest Products Classification and Definitions (FPC&D) v2022
notation: 053.11

Other non-coniferous, sleepers, other
type: Concept
broader: Other non-coniferous, sleepers
definition: Sleepers which are not treated with insecticides or fungicides nor impregnated.
in scheme: Forest Products Classification and Definitions (FPC&D) v2022
notation: 053.19

Other non-coniferous, sawnwood rough
type: Concept
broader: Other non-coniferous, sawnwood and sleepers
definition: Wood sawn or chipped lengthwise, not planed, sanded or finger-jointed. It may be green (undried) or dried. It excludes sawn and hewn railway sleepers, wood shingles and sawn veneer sheets.
in scheme: Forest Products Classification and Definitions (FPC&D) v2022
narrower: Other non-coniferous, sawnwood rough, other
narrower: Other non-coniferous, sawnwood rough, treated or impregnated
notation: 053.2

Other non-coniferous, sawnwood rough, treated or impregnated
type: Concept
broader: Other non-coniferous, sawnwood rough
definition: Wood sawn or chipped lengthwise, not planed, sanded or finger-jointed and which was treated with insecticides or fungicides for the purpose of protection. For long-term preservation they can be impregnated with creosote or other substances.
in scheme: Forest Products Classification and Definitions (FPC&D) v2022
notation: 053.21

Other non-coniferous, sawnwood rough, other
type: Concept
broader: Other non-coniferous, sawnwood rough
definition: Wood sawn or chipped lengthwise, not planed, sanded or finger-jointed and which was not treated for the purpose of protection.
in scheme: Forest Products Classification and Definitions (FPC&D) v2022
notation: 053.29

Other non-coniferous, sawnwood planed
type: Concept
broader: Other non-coniferous, sawnwood and sleepers
definition: Wood sawn or chipped lengthwise, and planed, sanded or finger-jointed.
in scheme: Forest Products Classification and Definitions (FPC&D) v2022
narrower: Other non-coniferous, sawnwood planed, treated or impregnated
narrower: Other non-coniferous, sawnwood planed, other
notation: 053.3

Other non-coniferous, sawnwood planed, treated or impregnated
type: Concept
broader: Other non-coniferous, sawnwood planed
definition: Wood sawn or chipped lengthwise, and planed, sanded or finger-jointed, which was not kiln- or air-dried but was treated with insecticides or fungicides for the purpose of protection. For long-term preservation they can be impregnated with creosote or other substances.
in scheme: Forest Products Classification and Definitions (FPC&D) v2022
notation: 053.31

Other non-coniferous, sawnwood planed, other
type: Concept
broader: Other non-coniferous, sawnwood planed
definition: Wood sawn or chipped lengthwise, and planed, sanded or finger-jointed, which was kiln- or air-dried but not treated for the purpose of protection.
in scheme: Forest Products Classification and Definitions (FPC&D) v2022
notation: 053.39

Other non-coniferous n.e.c.
type: Concept
broader: Other non-coniferous, sawnwood and sleepers
definition: N.A.
in scheme: Forest Products Classification and Definitions (FPC&D) v2022
notation: 053.9

VENEER SHEETS
type: Concept
definition: Thin sheets of wood of uniform thickness not exceeding 6 mm (excluding any reinforcing material), obtained by sawing, slicing or peeling (rotary cutting). Veneer sheets are used for the manufacture of plywood, laminated construction material, veneering furniture, veneer containers, etc.
in scheme: Forest Products Classification and Definitions (FPC&D) v2022
narrower: Decorative veneer sheets
narrower: Non-decorative veneer sheets
notation: 06
top concept of: Forest Products Classification and Definitions (FPC&D) v2022

Decorative veneer sheets
type: Concept
broader: VENEER SHEETS
definition: Veneer sheets whose face veneer has an attractive appearance due to figure, colour, grain, lustre, etc. The sheets for veneering of fine highly grained woods used in cabinet making veneers are more often obtained by sawing or slicing.
in scheme: Forest Products Classification and Definitions (FPC&D) v2022
narrower: Decorative veneer sheets, coniferous
narrower: Decorative veneer sheets, tropical non-coniferous
narrower: Other decorative veneer sheets
notation: 061.

Decorative veneer sheets, coniferous
type: Concept
broader: Decorative veneer sheets
definition: N.A.
in scheme: Forest Products Classification and Definitions (FPC&D) v2022
narrower: Decorative veneer sheets, coniferous, for plywood (faces)
narrower: Decorative veneer sheets, coniferous, for other purposes (facing of sawnwood, panel, furniture, etc.)
notation: 061.1

Decorative veneer sheets, coniferous, for plywood (faces)
type: Concept
broader: Decorative veneer sheets, coniferous
definition: Decorative veneer sheets for the manufacture of plywood. Because of its specific decorative characteristics this material is usually used on the face of plywood.
in scheme: Forest Products Classification and Definitions (FPC&D) v2022
notation: 061.11

Decorative veneer sheets, coniferous, for other purposes (facing of sawnwood, panel, furniture, etc.)
type: Concept
broader: Decorative veneer sheets, coniferous
definition: Decorative veneer sheets not intended for the manufacture of plywood. Possible uses are the veneering of furniture, sawnwood, or panels other than plywood, or marquetry and inlay work.
in scheme: Forest Products Classification and Definitions (FPC&D) v2022
notation: 061.19

Decorative veneer sheets, tropical non-coniferous
type: Concept
broader: Decorative veneer sheets
definition: N.A.
in scheme: Forest Products Classification and Definitions (FPC&D) v2022
narrower: Decorative veneer sheets, tropical non-coniferous, for plywood (faces)
narrower: Decorative veneer sheets, tropical non-coniferous, for other purposes (facing of sawnwood, panel, furniture, etc.)
notation: 061.2

Decorative veneer sheets, tropical non-coniferous, for plywood (faces)
type: Concept
broader: Decorative veneer sheets, tropical non-coniferous
definition: Decorative veneer sheets for the manufacture of plywood. Because of its specific decorative characteristics this material is usually used on the face of plywood.
in scheme: Forest Products Classification and Definitions (FPC&D) v2022
notation: 061.21

Decorative veneer sheets, tropical non-coniferous, for other purposes (facing of sawnwood, panel, furniture, etc.)
type: Concept
broader: Decorative veneer sheets, tropical non-coniferous
definition: Decorative veneer sheets not intended for the manufacture of plywood. Possible uses are the veneering of furniture, sawnwood, or panels other than plywood, or marquetry and inlay work.
in scheme: Forest Products Classification and Definitions (FPC&D) v2022
notation: 061.29

Other decorative veneer sheets
type: Concept
broader: Decorative veneer sheets
definition: N.A.
in scheme: Forest Products Classification and Definitions (FPC&D) v2022
narrower: Other decorative veneer sheets, for plywood (faces)
narrower: Other decorative veneer sheets, for other purposes (facing of sawnwood, panel, furniture, etc.)
notation: 061.9

Other decorative veneer sheets, for plywood (faces)
type: Concept
broader: Other decorative veneer sheets
definition: Decorative veneer sheets for the manufacture of plywood. Because of its specific decorative characteristics this material is usually used on the face of plywood.
in scheme: Forest Products Classification and Definitions (FPC&D) v2022
notation: 061.91

Other decorative veneer sheets, for other purposes (facing of sawnwood, panel, furniture, etc.)
type: Concept
broader: Other decorative veneer sheets
definition: Decorative veneer sheets not intended for the manufacture of plywood. Possible uses are the veneering of furniture, sawnwood, or panels other than plywood, or marquetry and inlay work.
in scheme: Forest Products Classification and Definitions (FPC&D) v2022
notation: 061.99

Non-decorative veneer sheets
type: Concept
broader: VENEER SHEETS
definition: Veneer sheets, usually peeled, without specific decorative characteristics. They are often used for the cores of plywood.
in scheme: Forest Products Classification and Definitions (FPC&D) v2022
narrower: Non-decorative veneer sheets, tropical non-coniferous
narrower: Non-decorative veneer sheets, coniferous
narrower: Other non-decorative veneer sheets
notation: 062.

Non-decorative veneer sheets, coniferous
type: Concept
broader: Non-decorative veneer sheets
definition: N.A.
in scheme: Forest Products Classification and Definitions (FPC&D) v2022
narrower: Non-decorative veneer sheets, coniferous, for plywood (face and core material)
narrower: Non-decorative veneer sheets, coniferous, for other purposes (match boxes, violin, … )
notation: 062.1

Non-decorative veneer sheets, coniferous, for plywood (face and core material)
type: Concept
broader: Non-decorative veneer sheets, coniferous
definition: Non-decorative veneer sheets used for the manufacture of plywood. They may either be used in the core or for the face of those plywoods for which a face of decorative veneer sheets is not considered necessary. Woods used for the manufacture of plywood are generally cut by the peeling process.
in scheme: Forest Products Classification and Definitions (FPC&D) v2022
notation: 062.11

Non-decorative veneer sheets, coniferous, for other purposes (match boxes, violin, … )
type: Concept
broader: Non-decorative veneer sheets, coniferous
definition: Non-decorative veneer sheets not used for the manufacture of plywood. Included in this item are veneer sheets for match boxes, violins, cigar boxes, etc. It excludes chipwood (subgroups 024.15, 024.95) which is used for plaiting or to make chip baskets, pill boxes, etc.
in scheme: Forest Products Classification and Definitions (FPC&D) v2022
notation: 062.19

Non-decorative veneer sheets, tropical non-coniferous
type: Concept
broader: Non-decorative veneer sheets
definition: N.A.
in scheme: Forest Products Classification and Definitions (FPC&D) v2022
narrower: Non-decorative veneer sheets, tropical non-coniferous, for other purposes (match boxes, violin, … )
narrower: Non-decorative veneer sheets, tropical non-coniferous, for plywood (face and core material)
notation: 062.2

Non-decorative veneer sheets, tropical non-coniferous, for plywood (face and core material)
type: Concept
broader: Non-decorative veneer sheets, tropical non-coniferous
definition: Non-decorative veneer sheets used for the manufacture of plywood. They may either be used in the core or for the face of those plywoods for which a face of decorative veneer sheets is not considered necessary. Woods used for the manufacture of plywood are generally cut by the peeling process.
in scheme: Forest Products Classification and Definitions (FPC&D) v2022
notation: 062.21

Non-decorative veneer sheets, tropical non-coniferous, for other purposes (match boxes, violin, … )
type: Concept
broader: Non-decorative veneer sheets, tropical non-coniferous
definition: Non-decorative veneer sheets not used for the manufacture of plywood. Included in this item are veneer sheets for match boxes, violins, cigar boxes, etc. It excludes chipwood (subgroups 024.15, 024.95) which is used for plaiting or to make chip baskets, pill boxes, etc.
in scheme: Forest Products Classification and Definitions (FPC&D) v2022
notation: 062.29

Other non-decorative veneer sheets
type: Concept
broader: Non-decorative veneer sheets
definition: N.A.
in scheme: Forest Products Classification and Definitions (FPC&D) v2022
narrower: Other non-decorative veneer sheets, for other purposes (match boxes, violin, … )
narrower: Other non-decorative veneer sheets, for plywood (face and core material)
notation: 062.9

Other non-decorative veneer sheets, for plywood (face and core material)
type: Concept
broader: Other non-decorative veneer sheets
definition: Non-decorative veneer sheets used for the manufacture of plywood. They may either be used in the core or for the face of those plywoods for which a face of decorative veneer sheets is not considered necessary. Woods used for the manufacture of plywood are generally cut by the peeling process.
in scheme: Forest Products Classification and Definitions (FPC&D) v2022
notation: 062.91

Other non-decorative veneer sheets, for other purposes (match boxes, violin, … )
type: Concept
broader: Other non-decorative veneer sheets
definition: Non-decorative veneer sheets not used for the manufacture of plywood. Included in this item are veneer sheets for match boxes, violins, cigar boxes, etc. It excludes chipwood (subgroups 024.15, 024.95) which is used for plaiting or to make chip baskets, pill boxes, etc.
in scheme: Forest Products Classification and Definitions (FPC&D) v2022
notation: 062.99

WOOD-BASED PANELS
type: Concept
definition: This product category is an aggregate comprising plywood, particle board, oriented strand board (OSB), fibreboard, densified wood, combination board and other panels based on wood or other ligno-cellulosic materials.
in scheme: Forest Products Classification and Definitions (FPC&D) v2022
narrower: Combination board
narrower: Plywood
narrower: Oriented strand board (OSB)
narrower: Other panels based on wood or other ligno-cellulosic materials
narrower: Particle board
narrower: Densified wood
narrower: Fibreboard
notation: 07
top concept of: Forest Products Classification and Definitions (FPC&D) v2022

Plywood
type: Concept
broader: WOOD-BASED PANELS
definition: Plywood is a panel consisting of an assembly of veneer sheets bonded together with the direction of the grain in alternate plies generally at right angles. The veneer sheets are usually placed symmetrically on both sides of a central ply or core that may itself be made from a veneer sheet or another material. It includes veneer plywood, core plywood or blockboard, cellular board and composite plywood. It excludes laminated construction materials (e.g. glulam), where the grain of the veneer sheets generally runs in the same direction.
in scheme: Forest Products Classification and Definitions (FPC&D) v2022
narrower: Cellular board
narrower: Veneer plywood
narrower: Other plywood n.e.c.
narrower: Laminated veneered lumber (LVL)
narrower: Core plywood
notation: 071.

Veneer plywood
type: Concept
broader: Plywood
definition: Plywood manufactured by bonding together more than two veneer sheets, where the grain of alternate veneer sheets is crossed, generally at right angles.
in scheme: Forest Products Classification and Definitions (FPC&D) v2022
narrower: Veneer plywood, coniferous
narrower: Other veneer plywood
narrower: Veneer plywood, tropical non-coniferous
notation: 071.1

Veneer plywood, coniferous
type: Concept
broader: Veneer plywood
definition: N.A.
in scheme: Forest Products Classification and Definitions (FPC&D) v2022
narrower: Veneer plywood, coniferous, interior grade
narrower: Veneer plywood, coniferous, exterior grade
notation: 071.11

Veneer plywood, coniferous, interior grade
type: Concept
broader: Veneer plywood, coniferous
definition: Veneer plywood suitable only for indoor applications.
in scheme: Forest Products Classification and Definitions (FPC&D) v2022
notation: 071.111

Veneer plywood, coniferous, exterior grade
type: Concept
broader: Veneer plywood, coniferous
definition: Veneer plywood in which waterproof glue is used to bond plies. It is a resin-based glue similar to the glue used in wooden ships. It dries to a hard, crystal substance that will never yield to moisture of any kind. It is suitable for indoor and outdoor applications.
in scheme: Forest Products Classification and Definitions (FPC&D) v2022
notation: 071.112

Veneer plywood, tropical non-coniferous
type: Concept
broader: Veneer plywood
definition: Non-coniferous (tropical) plywood is defined as having at least one face sheet of non-coniferous (tropical) wood.
in scheme: Forest Products Classification and Definitions (FPC&D) v2022
narrower: Veneer plywood, tropical non-coniferous, interior grade
narrower: Veneer plywood, tropical non-coniferous, exterior grade
notation: 071.12

Veneer plywood, tropical non-coniferous, interior grade
type: Concept
broader: Veneer plywood, tropical non-coniferous
definition: Veneer plywood suitable only for indoor applications.
in scheme: Forest Products Classification and Definitions (FPC&D) v2022
notation: 071.121

Veneer plywood, tropical non-coniferous, exterior grade
type: Concept
broader: Veneer plywood, tropical non-coniferous
definition: Veneer plywood in which waterproof glue is used to bond plies. It is a resin-based glue similar to the glue used in wooden ships. It dries to a hard, crystal substance that will never yield to moisture of any kind. It is suitable for indoor and outdoor applications.
in scheme: Forest Products Classification and Definitions (FPC&D) v2022
notation: 071.122

Other veneer plywood
type: Concept
broader: Veneer plywood
definition: N.A.
in scheme: Forest Products Classification and Definitions (FPC&D) v2022
narrower: Other veneer plywood, exterior grade
narrower: Other veneer plywood, interior grade
notation: 071.19

Other veneer plywood, interior grade
type: Concept
broader: Other veneer plywood
definition: Veneer plywood suitable only for indoor applications.
in scheme: Forest Products Classification and Definitions (FPC&D) v2022
notation: 071.191

Other veneer plywood, exterior grade
type: Concept
broader: Other veneer plywood
definition: Veneer plywood in which waterproof glue is used to bond plies. It is a resin-based glue similar to the glue used in wooden ships. It dries to a hard, crystal substance that will never yield to moisture of any kind. It is suitable for indoor and outdoor applications.
in scheme: Forest Products Classification and Definitions (FPC&D) v2022
notation: 071.192

Core plywood
type: Concept
broader: Plywood
definition: Core plywood is a plywood with a solid core. Core can consist of MDF, particle board, veneer or from narrow boards, blocks or strips of wood.
in scheme: Forest Products Classification and Definitions (FPC&D) v2022
narrower: Core plywood, with at least one outer ply of tropical wood
narrower: Other core plywood, with at least one outer ply of non-coniferous non-tropical wood
narrower: Core plywood, with both outer plies of coniferous wood
notation: 071.2

Core plywood, with both outer plies of coniferous wood
type: Concept
broader: Core plywood
definition: Core plywood is a plywood with a solid core. Core can consist of MDF, particle board, veneer or from narrow boards, blocks or strips of wood.
in scheme: Forest Products Classification and Definitions (FPC&D) v2022
narrower: Core plywood, with both outer plies of coniferous wood, n.e.c. (MDF core, particleboard core, veneer core, etc.)
narrower: Core plywood, with both outer plies of coniferous wood, blockboard, laminboard and battenboard
notation: 071.21

Core plywood, with both outer plies of coniferous wood, blockboard, laminboard and battenboard
type: Concept
broader: Core plywood, with both outer plies of coniferous wood
definition: Plywood with a solid core (i.e. the central layer, generally thicker than the other plies) that consists of narrow boards, blocks or strips of wood placed side by side, which may or may not be glued together.
in scheme: Forest Products Classification and Definitions (FPC&D) v2022
notation: 071.211

Core plywood, with both outer plies of coniferous wood, n.e.c. (MDF core, particleboard core, veneer core, etc.)
type: Concept
broader: Core plywood, with both outer plies of coniferous wood
definition: Plywood in which the wooden core is replaced by other materials such as a layer or layers of particle board, fibreboard, wood waste glued together, etc.
in scheme: Forest Products Classification and Definitions (FPC&D) v2022
notation: 071.219

Core plywood, with at least one outer ply of tropical wood
type: Concept
broader: Core plywood
definition: Core plywood is a plywood with a solid core. Core can consist of MDF, particle board, veneer or from narrow boards, blocks or strips of wood.
in scheme: Forest Products Classification and Definitions (FPC&D) v2022
narrower: Core plywood, with at least one outer ply of tropical wood, n.e.c. (MDF core, particleboard core, veneer core, etc.)
narrower: Core plywood, with at least one outer ply of tropical wood, blockboard, laminboard and battenboard
notation: 071.22

Core plywood, with at least one outer ply of tropical wood, blockboard, laminboard and battenboard
type: Concept
broader: Core plywood, with at least one outer ply of tropical wood
definition: Plywood with a solid core (i.e. the central layer, generally thicker than the other plies) that consists of narrow boards, blocks or strips of wood placed side by side, which may or may not be glued together.
in scheme: Forest Products Classification and Definitions (FPC&D) v2022
notation: 071.221

Core plywood, with at least one outer ply of tropical wood, n.e.c. (MDF core, particleboard core, veneer core, etc.)
type: Concept
broader: Core plywood, with at least one outer ply of tropical wood
definition: Plywood in which the wooden core is replaced by other materials such as a layer or layers of particle board, fibreboard, wood waste glued together, etc.
in scheme: Forest Products Classification and Definitions (FPC&D) v2022
notation: 071.229

Other core plywood, with at least one outer ply of non-coniferous non-tropical wood
type: Concept
broader: Core plywood
definition: Core plywood is a plywood with a solid core. Core can consist of MDF, particle board, veneer or from narrow boards, blocks or strips of wood.
in scheme: Forest Products Classification and Definitions (FPC&D) v2022
narrower: Other core plywood, with at least one outer ply of non-coniferous non-tropical wood , blockboard, laminboard and battenboard
narrower: Other core plywood, with at least one outer ply of non-coniferous non-tropical wood n.e.c. (MDF core, particleboard core, veneer core, etc.)
notation: 071.29

Other core plywood, with at least one outer ply of non-coniferous non-tropical wood , blockboard, laminboard and battenboard
type: Concept
broader: Other core plywood, with at least one outer ply of non-coniferous non-tropical wood
definition: Plywood with a solid core (i.e. the central layer, generally thicker than the other plies) that consists of narrow boards, blocks or strips of wood placed side by side, which may or may not be glued together.
in scheme: Forest Products Classification and Definitions (FPC&D) v2022
notation: 071.291

Other core plywood, with at least one outer ply of non-coniferous non-tropical wood n.e.c. (MDF core, particleboard core, veneer core, etc.)
type: Concept
broader: Other core plywood, with at least one outer ply of non-coniferous non-tropical wood
definition: Plywood in which the wooden core is replaced by other materials such as a layer or layers of particle board, fibreboard, wood waste glued together, etc.
in scheme: Forest Products Classification and Definitions (FPC&D) v2022
notation: 071.299

Cellular board
type: Concept
broader: Plywood
definition: Plywood with a core of cellular construction, which are somewhat similar in appearance to the blockboard and battenboard but the battens or laths forming the core are spaced one from the other, either parallel or in lattice form. Cellular boards are used for partitions, doors and sometimes in the manufacture of furniture.
in scheme: Forest Products Classification and Definitions (FPC&D) v2022
narrower: Cellular board, coniferous
narrower: Cellular board, tropical non-coniferous
narrower: Other cellular board
notation: 071.3

Cellular board, coniferous
type: Concept
broader: Cellular board
definition: Plywood with a core of cellular construction, which are somewhat similar in appearance to the blockboard and battenboard but the battens or laths forming the core are spaced one from the other, either parallel or in lattice form. Cellular boards are used for partitions, doors and sometimes in the manufacture of furniture.
in scheme: Forest Products Classification and Definitions (FPC&D) v2022
notation: 071.31

Cellular board, tropical non-coniferous
type: Concept
broader: Cellular board
definition: Plywood with a core of cellular construction, which are somewhat similar in appearance to the blockboard and battenboard but the battens or laths forming the core are spaced one from the other, either parallel or in lattice form. Cellular boards are used for partitions, doors and sometimes in the manufacture of furniture.
in scheme: Forest Products Classification and Definitions (FPC&D) v2022
notation: 071.32

Other cellular board
type: Concept
broader: Cellular board
definition: Plywood with a core of cellular construction, which are somewhat similar in appearance to the blockboard and battenboard but the battens or laths forming the core are spaced one from the other, either parallel or in lattice form. Cellular boards are used for partitions, doors and sometimes in the manufacture of furniture.
in scheme: Forest Products Classification and Definitions (FPC&D) v2022
notation: 071.39

Laminated veneered lumber (LVL)
type: Concept
broader: Plywood
definition: Laminated veneer lumber is the wood product that uses multiple layers of thin wood assembled with adhesives. Laminated veneer lumber is similar in appearance to plywood without crossbands.
in scheme: Forest Products Classification and Definitions (FPC&D) v2022
narrower: Other Laminated veneered lumber
narrower: Laminated veneered lumber, with both outer plies of coniferous wood
narrower: Laminated veneered lumber, with at least one outer ply of tropical wood
notation: 071.4

Laminated veneered lumber, with both outer plies of coniferous wood
type: Concept
broader: Laminated veneered lumber (LVL)
definition: Laminated veneer lumber is the wood product that uses multiple layers of thin wood assembled with adhesives. Laminated veneer lumber is similar in appearance to plywood without crossbands.
in scheme: Forest Products Classification and Definitions (FPC&D) v2022
notation: 071.41

Laminated veneered lumber, with at least one outer ply of tropical wood
type: Concept
broader: Laminated veneered lumber (LVL)
definition: Laminated veneer lumber is the wood product that uses multiple layers of thin wood assembled with adhesives. Laminated veneer lumber is similar in appearance to plywood without crossbands.
in scheme: Forest Products Classification and Definitions (FPC&D) v2022
notation: 071.42

Other Laminated veneered lumber
type: Concept
broader: Laminated veneered lumber (LVL)
definition: Laminated veneer lumber is the wood product that uses multiple layers of thin wood assembled with adhesives. Laminated veneer lumber is similar in appearance to plywood without crossbands.
in scheme: Forest Products Classification and Definitions (FPC&D) v2022
notation: 071.49

Other plywood n.e.c.
type: Concept
broader: Plywood
definition: N.A.
in scheme: Forest Products Classification and Definitions (FPC&D) v2022
narrower: Other plywood n.e.c., with both outer plies of coniferous wood
narrower: Other plywood n.e.c., with at least one outer ply of tropical wood
narrower: Other plywood n.e.c., other
notation: 071.9

Other plywood n.e.c., with both outer plies of coniferous wood
type: Concept
broader: Other plywood n.e.c.
definition: N.A.
in scheme: Forest Products Classification and Definitions (FPC&D) v2022
notation: 071.91

Other plywood n.e.c., with at least one outer ply of tropical wood
type: Concept
broader: Other plywood n.e.c.
definition: N.A.
in scheme: Forest Products Classification and Definitions (FPC&D) v2022
notation: 071.92

Other plywood n.e.c., other
type: Concept
broader: Other plywood n.e.c.
definition: N.A.
in scheme: Forest Products Classification and Definitions (FPC&D) v2022
notation: 071.99

Particle board
type: Concept
broader: WOOD-BASED PANELS
definition: Flat-pressed or moulded panels manufactured from particles of wood or other ligno-cellulosic materials bonded by a suitable, usually organic, binder in the presence of heat and pressure. They may also be manufactured by extruding the materials into a mould under heat and pressure. Extruded particle board may be solid or with hollow cavities. The density of particle boards varies with the density of raw materials used and the binder, pressures and temperatures used in manufacture. It includes special types of particle board as waferboard and oriented particle board. It excludes wood wool board or other boards with mineral binders.
in scheme: Forest Products Classification and Definitions (FPC&D) v2022
narrower: Particle board of ligno-cellulosic material other than wood (flax, bagasse, bamboo)
narrower: Wood particle board
notation: 072.

Wood particle board
type: Concept
broader: Particle board
definition: Particle board manufactured from particles of wood.
in scheme: Forest Products Classification and Definitions (FPC&D) v2022
narrower: Wood particle board, waferboard
narrower: Wood particle board, medium density particle board
narrower: Wood particle board, extruded particle board
narrower: Other wood particle board n.e.c.
notation: 072.1

Wood particle board, waferboard
type: Concept
broader: Wood particle board
definition: Special type of platen pressed particle board, made up of long particles ("wafers"), which are less than twice as long as they are wide and thereby improving the strength characteristics of the board.
in scheme: Forest Products Classification and Definitions (FPC&D) v2022
notation: 072.11

Wood particle board, medium density particle board
type: Concept
broader: Wood particle board
definition: Medium density particle board (MDP) panel is composed of a synthetic adhesive matrix and a reinforcing phase composed of wood particles (usually Eucalyptus). The wood particles are arranged in three layers. The particles are positioned in a differentiated manner, the largest are laid in the middle and the thinner particles are placed on the outer surfaces, creating three layers. They are glued and compressed with a synthetic resin by applying pressure and heat at the same time in a state-of-the-art continuous press.
in scheme: Forest Products Classification and Definitions (FPC&D) v2022
notation: 072.12

Wood particle board, extruded particle board
type: Concept
broader: Wood particle board
definition: Particle boards made by extrusion the mixture of wood particles and resin through a die. The particles lie with their larger dimensions mainly at right angles to the direction of extrusion. They are used as cores or middle layers.
in scheme: Forest Products Classification and Definitions (FPC&D) v2022
notation: 072.13

Other wood particle board n.e.c.
type: Concept
broader: Wood particle board
definition: Other wood particle board n.e.c. not mentioned under 072.11, 072.12, 072.13
in scheme: Forest Products Classification and Definitions (FPC&D) v2022
notation: 072.19

Particle board of ligno-cellulosic material other than wood (flax, bagasse, bamboo)
type: Concept
broader: Particle board
definition: Particle board of bagasse, flax, hemp, straw or other non-wood ligno­cellulosic materials.
in scheme: Forest Products Classification and Definitions (FPC&D) v2022
notation: 072.9

Oriented strand board (OSB)
type: Concept
broader: WOOD-BASED PANELS
definition: A structural board in which layers of narrow wafers are layered alternately at right angles in order to give the board greater elastomechanical properties. The wafers, which resemble small pieces of veneer, are coated with e.g. waterproof phenolic resin glue, interleaved together in mats and then bonded together under heat and pressure. The resulting product is a solid, uniform building panel having high strength and water resistance.
in scheme: Forest Products Classification and Definitions (FPC&D) v2022
narrower: General purpose OSB and OSB for interior fitments
narrower: Load-bearing OSB
narrower: Heavy-duty load-bearing OSB
narrower: Other oriented strandboard n.e.c.
notation: 073.

General purpose OSB and OSB for interior fitments
type: Concept
broader: Oriented strand board (OSB)
definition: OSB used only in dry conditions, mainly for interior fitments (including furniture), grade OSB/1.
in scheme: Forest Products Classification and Definitions (FPC&D) v2022
narrower: General purpose OSB and OSB for interior fitments, used in dry conditions
narrower: Other general purpose OSB and OSB for interior fitments
notation: 073.1

General purpose OSB and OSB for interior fitments, used in dry conditions
type: Concept
broader: General purpose OSB and OSB for interior fitments
definition: OSB used only in dry conditions, mainly for interior fitments (including furniture), grade OSB/1.
in scheme: Forest Products Classification and Definitions (FPC&D) v2022
notation: 073.11

Other general purpose OSB and OSB for interior fitments
type: Concept
broader: General purpose OSB and OSB for interior fitments
definition: OSB used only in dry conditions, mainly for interior fitments (including furniture), grade OSB/1.
in scheme: Forest Products Classification and Definitions (FPC&D) v2022
notation: 073.19

Load-bearing OSB
type: Concept
broader: Oriented strand board (OSB)
definition: Load-bearing OSB used in dry (grade OSB/2) or humid (grade OSB/3) conditions.
in scheme: Forest Products Classification and Definitions (FPC&D) v2022
narrower: Load-bearing OSB, used in dry conditions
narrower: Other load-bearing OSB
notation: 073.2

Load-bearing OSB, used in dry conditions
type: Concept
broader: Load-bearing OSB
definition: Load-bearing OSB used in dry (grade OSB/2) or humid (grade OSB/3) conditions.
in scheme: Forest Products Classification and Definitions (FPC&D) v2022
notation: 073.21

Other load-bearing OSB
type: Concept
broader: Load-bearing OSB
definition: Load-bearing OSB used in dry (grade OSB/2) or humid (grade OSB/3) conditions.
in scheme: Forest Products Classification and Definitions (FPC&D) v2022
notation: 073.29

Heavy-duty load-bearing OSB
type: Concept
broader: Oriented strand board (OSB)
definition: Heavy-duty load-bearing boards used in humid conditions (grade OSB/4).
in scheme: Forest Products Classification and Definitions (FPC&D) v2022
narrower: Heavy-duty load-bearing OSB, used in humid conditions
narrower: Other heavy-duty load-bearing OSB
notation: 073.3

Heavy-duty load-bearing OSB, used in humid conditions
type: Concept
broader: Heavy-duty load-bearing OSB
definition: Heavy-duty load-bearing boards used in humid conditions (grade OSB/4).
in scheme: Forest Products Classification and Definitions (FPC&D) v2022
notation: 073.31

Other heavy-duty load-bearing OSB
type: Concept
broader: Heavy-duty load-bearing OSB
definition: Heavy-duty load-bearing boards used in humid conditions (grade OSB/4).
in scheme: Forest Products Classification and Definitions (FPC&D) v2022
notation: 073.39

Other oriented strandboard n.e.c.
type: Concept
broader: Oriented strand board (OSB)
definition: N.A.
in scheme: Forest Products Classification and Definitions (FPC&D) v2022
notation: 073.9

Fibreboard
type: Concept
broader: WOOD-BASED PANELS
definition: A panel manufactured from fibres of wood or other ligno-cellulosic materials (bamboo, bagasse) with the primary bond deriving from the felting of the fibres and their inherent adhesive properties. Additional resins or other organic bonding substances may be used to agglomerate the fibres. Fibreboard may consist of a single sheet or of several sheets bonded together. It includes fibreboard panels that are flat-pressed and moulded fibreboard products.
in scheme: Forest Products Classification and Definitions (FPC&D) v2022
narrower: Dry process fibreboard
narrower: Wet process fibreboard
notation: 074.

Dry process fibreboard
type: Concept
broader: Fibreboard
definition: Dry process fibreboards are engineered woodbased panel materials made by bonding together wood fibres with a synthetic resin adhesive. The resinated fibres are dried and then formed into a mattress ready for pressing. The mattress is pressed between heated polished press plates to the desired thickness. Dry process fibreboards have a fibre moisture content of less than 20 % at the forming stage.
in scheme: Forest Products Classification and Definitions (FPC&D) v2022
narrower: Dry process fibreboard of a density exceeding 0.5 g/cm³ but not exceeding 0.8 g/cm³
narrower: Dry process fibreboard of a density exceeding 0.8 g/cm³
narrower: Dry process fibreboard of a density not exceeding 0.5 g/cm³
notation: 074.1

Dry process fibreboard of a density not exceeding 0.5 g/cm³
type: Concept
broader: Dry process fibreboard
definition: Low density fibreboard is a wood-fibre insulation board produced in the dry process.
in scheme: Forest Products Classification and Definitions (FPC&D) v2022
notation: 074.11

Dry process fibreboard of a density exceeding 0.5 g/cm³ but not exceeding 0.8 g/cm³
type: Concept
broader: Dry process fibreboard
definition: It is a medium density fibreboard (MDF) of a density ranges from 0.5 g/cm³ to 0.8 g/cm³. Additional thermosetting resins are added to the dried wood fibres in order to assist the bonding process in the press. It can be used in many different applications such as furniture, interior decoration and in building.
in scheme: Forest Products Classification and Definitions (FPC&D) v2022
narrower: Dry process fibreboard of a density exceeding 0.5 g/cm³ but not exceeding 0.8 g/cm³ , of a thickness not exceeding 5 mm
narrower: Dry process fibreboard of a density exceeding 0.5 g/cm³ but not exceeding 0.8 g/cm³ , of a thickness exceeding 5 mm but not exceeding 9 mm
narrower: Dry process fibreboard of a density exceeding 0.5 g/cm³ but not exceeding 0.8 g/cm³ , of a thickness exceeding 9 mm
notation: 074.12

Dry process fibreboard of a density exceeding 0.5 g/cm³ but not exceeding 0.8 g/cm³ , of a thickness not exceeding 5 mm
type: Concept
broader: Dry process fibreboard of a density exceeding 0.5 g/cm³ but not exceeding 0.8 g/cm³
definition: N.A.
in scheme: Forest Products Classification and Definitions (FPC&D) v2022
notation: 074.121

Dry process fibreboard of a density exceeding 0.5 g/cm³ but not exceeding 0.8 g/cm³ , of a thickness exceeding 5 mm but not exceeding 9 mm
type: Concept
broader: Dry process fibreboard of a density exceeding 0.5 g/cm³ but not exceeding 0.8 g/cm³
definition: N.A.
in scheme: Forest Products Classification and Definitions (FPC&D) v2022
notation: 074.122

Dry process fibreboard of a density exceeding 0.5 g/cm³ but not exceeding 0.8 g/cm³ , of a thickness exceeding 9 mm
type: Concept
broader: Dry process fibreboard of a density exceeding 0.5 g/cm³ but not exceeding 0.8 g/cm³
definition: N.A.
in scheme: Forest Products Classification and Definitions (FPC&D) v2022
notation: 074.123

Dry process fibreboard of a density exceeding 0.8 g/cm³
type: Concept
broader: Dry process fibreboard
definition: It is a high-density fibreboard (HDF) of a density exceeding 0.8 g/cm³ produced in the dry process
in scheme: Forest Products Classification and Definitions (FPC&D) v2022
narrower: Dry process fibreboard of a density exceeding 0.8 g/cm³, of a thickness not exceeding 5 mm
narrower: Dry process fibreboard of a density exceeding 0.8 g/cm³, of a thickness exceeding 5 mm but not exceeding 9 mm
narrower: Dry process fibreboard of a density exceeding 0.8 g/cm³, of a thickness exceeding 9 mm
notation: 074.13

Dry process fibreboard of a density exceeding 0.8 g/cm³, of a thickness not exceeding 5 mm
type: Concept
broader: Dry process fibreboard of a density exceeding 0.8 g/cm³
definition: N.A.
in scheme: Forest Products Classification and Definitions (FPC&D) v2022
notation: 074.131

Dry process fibreboard of a density exceeding 0.8 g/cm³, of a thickness exceeding 5 mm but not exceeding 9 mm
type: Concept
broader: Dry process fibreboard of a density exceeding 0.8 g/cm³
definition: N.A.
in scheme: Forest Products Classification and Definitions (FPC&D) v2022
notation: 074.132

Dry process fibreboard of a density exceeding 0.8 g/cm³, of a thickness exceeding 9 mm
type: Concept
broader: Dry process fibreboard of a density exceeding 0.8 g/cm³
definition: N.A.
in scheme: Forest Products Classification and Definitions (FPC&D) v2022
notation: 074.133

Wet process fibreboard
type: Concept
broader: Fibreboard
definition: The wet fibres are formed into a mat which is either rolled (softboards), or rolled and then pressed, at a high temperature to the desired thickness. The primary bond is generally derived from the felting together of the fibres and their inherent adhesive properties, although in some instances a synthetic adhesive may be added to the fibres. Other additives such as wax, bitumen emulsion, natural oil or fire retardant chemicals may also be added. Wet process fibreboards have a fibre moisture content of more than 20 % at the forming stage.
in scheme: Forest Products Classification and Definitions (FPC&D) v2022
narrower: Wet process fibreboard, of a density exceeding 0.5 g/cm³ but not exceeding 0.8 g/cm³
narrower: Wet process fibreboard, of a density not exceeding 0.5 g/cm³
narrower: Wet process fibreboard, of a density exceeding 0.8 g/cm³
notation: 074.2

Wet process fibreboard, of a density not exceeding 0.5 g/cm³
type: Concept
broader: Wet process fibreboard
definition: It is a wet-process fibreboard of a density not exceeding 0.5 g/cm3. These boards are used mainly for thermal or sound insulation in building.
in scheme: Forest Products Classification and Definitions (FPC&D) v2022
notation: 074.21

Wet process fibreboard, of a density exceeding 0.5 g/cm³ but not exceeding 0.8 g/cm³
type: Concept
broader: Wet process fibreboard
definition: It is a wet-process fibreboard of a density exceeding 0.5 g/cm3 but not exceeding 0.8 g/cm³. It is mainly used in furniture production and for interior or exterior walls.
in scheme: Forest Products Classification and Definitions (FPC&D) v2022
notation: 074.22

Wet process fibreboard, of a density exceeding 0.8 g/cm³
type: Concept
broader: Wet process fibreboard
definition: This type of fibreboard has one smooth and one rough surface with a mesh pattern. It is mainly used for furniture, in the automotive industries, for door skins and for packaging. It excludes similar products made from pieces of wood, wood flour or other ligno-cellulosic material where additional binders are required to make the panel; and panels made of gypsum or other mineral material.
in scheme: Forest Products Classification and Definitions (FPC&D) v2022
notation: 074.23

Densified wood
type: Concept
broader: WOOD-BASED PANELS
definition: Densified wood has been chemically or physically treated to increase its density or hardness and improve its mechanical strength or resistance to chemical or electrical agencies. It may be solid or consist of several layers bonded together and have a density as great as 1.4 g/cm3. It is generally used in the manufacture of gears, shuttles, bearings and other machine parts, propellers, insulators and other electric goods, etc.
in scheme: Forest Products Classification and Definitions (FPC&D) v2022
notation: 075.

Combination board
type: Concept
broader: WOOD-BASED PANELS
definition: Boards which have special properties as a result of the combination of two or more wood-based panels. The latter may be identifiable in their own right under other items of the classification, but under the present item they form an integral part of the panel. It excludes panels covered with veneers that are classified as plywood.
in scheme: Forest Products Classification and Definitions (FPC&D) v2022
narrower: Particle board covered on one or both faces with fibreboard
narrower: Several particle boards whether or not covered on one or both faces with fibreboard
narrower: Several particle boards and several fibreboards assembled in any order
narrower: Other combination boards n.e.c.
notation: 076.

Particle board covered on one or both faces with fibreboard
type: Concept
broader: Combination board
definition: Laminated panels consisting of particle board covered on one or both faces with fibreboard.
in scheme: Forest Products Classification and Definitions (FPC&D) v2022
notation: 076.1

Several particle boards whether or not covered on one or both faces with fibreboard
type: Concept
broader: Combination board
definition: Laminated panels consisting of several particle boards whether or not covered on one or both faces with fibreboard.
in scheme: Forest Products Classification and Definitions (FPC&D) v2022
notation: 076.2

Several particle boards and several fibreboards assembled in any order
type: Concept
broader: Combination board
definition: Laminated panels consisting of several particle boards and several fibreboards assembled in any order.
in scheme: Forest Products Classification and Definitions (FPC&D) v2022
notation: 076.3

Other combination boards n.e.c.
type: Concept
broader: Combination board
definition: Combination boards other than those included in the groups 0761, 0762, 0763.
in scheme: Forest Products Classification and Definitions (FPC&D) v2022
notation: 076.9

Other panels based on wood or other ligno-cellulosic materials
type: Concept
broader: WOOD-BASED PANELS
definition: This heading includes notably cement bonded panels, other mineral bonded panels and thermoplastic bonded panels.
in scheme: Forest Products Classification and Definitions (FPC&D) v2022
narrower: Other panels n.e.c.
narrower: Cement bonded panels
narrower: Thermoplastic bonded panels
narrower: Mineral bonded panels, other than cement bonded
notation: 077.

Cement bonded panels
type: Concept
broader: Other panels based on wood or other ligno-cellulosic materials
definition: Panels manufactured from wood wool, chips, particles, flakes, etc. of wood or other ligno-cellulosic material bonded together with cement and chemical additives. Wood constitutes the major part of the panel, by volume.
in scheme: Forest Products Classification and Definitions (FPC&D) v2022
narrower: Cement bonded panels, wood strand cement board (cement OSB)
narrower: Cement bonded panels, cement bonded particle board
narrower: Other cement bonded panels
narrower: Cement bonded panels, cement bonded wood wool board
narrower: Cement bonded panels, fibre-reinforced cement board
notation: 077.1

Cement bonded panels, cement bonded particle board
type: Concept
broader: Cement bonded panels
definition: The panel is a mixture of wood particles and Portland cement together with some additives. The mat is formed in three layers, the outer layers comprising small chips. Unlike normal particleboard production in a multi-daylight press, the set of cauls in cement bonded particle boards production must be kept under pressure until the cement has set.
in scheme: Forest Products Classification and Definitions (FPC&D) v2022
notation: 077.11

Cement bonded panels, cement bonded wood wool board
type: Concept
broader: Cement bonded panels
definition: The panel is made of wood wool and Portland cement with addition of natural mineralizing agent. Wood strands are first impregnated, and then by pressing they are bonded with cement in the continuous technological process. In this process wood strands become resistant to expanding, insects, rotting, water absorption, and fire resistance is also significantly improved.
in scheme: Forest Products Classification and Definitions (FPC&D) v2022
notation: 077.12

Cement bonded panels, wood strand cement board (cement OSB)
type: Concept
broader: Cement bonded panels
definition: Panels composed of long and thin wood strands bonded with Portland cement.
in scheme: Forest Products Classification and Definitions (FPC&D) v2022
notation: 077.13

Cement bonded panels, fibre-reinforced cement board
type: Concept
broader: Cement bonded panels
definition: There is a combination of cement and reinforcing fibers. These fibers can be of different origin (cellulose fibres, glass fibres, … )
in scheme: Forest Products Classification and Definitions (FPC&D) v2022
notation: 077.14

Other cement bonded panels
type: Concept
broader: Cement bonded panels
definition: Includes notably wood-cement blocks wherein the wood particles are of varying type.
in scheme: Forest Products Classification and Definitions (FPC&D) v2022
notation: 077.19

Mineral bonded panels, other than cement bonded
type: Concept
broader: Other panels based on wood or other ligno-cellulosic materials
definition: Panels manufactured from chips particles, flakes etc. of wood or other ligno-cellulosic materials, bonded together with mineral binders other than cement, and chemical additives (e.g. gypsum board).
in scheme: Forest Products Classification and Definitions (FPC&D) v2022
narrower: Mineral bonded panels, other than cement bonded, gypsum fibreboard
narrower: Mineral bonded panels, other than cement bonded, gypsum particle board
narrower: Other mineral bonded panels, other than cement bonded
notation: 077.2

Mineral bonded panels, other than cement bonded, gypsum fibreboard
type: Concept
broader: Mineral bonded panels, other than cement bonded
definition: Panels manufactured from gypsum and cellulose or recycled paper fibres. These two natural raw materials are mixed with water, without any other binders being added. The mixture is then pressed into stable boards under high pressure, dried, coated with a water repellent.
in scheme: Forest Products Classification and Definitions (FPC&D) v2022
notation: 077.21

Mineral bonded panels, other than cement bonded, gypsum particle board
type: Concept
broader: Mineral bonded panels, other than cement bonded
definition: Panels manufactured from gypsum and particles of wood, bagasse, straw or other ligno-cellulosic materials.
in scheme: Forest Products Classification and Definitions (FPC&D) v2022
notation: 077.22

Other mineral bonded panels, other than cement bonded
type: Concept
broader: Mineral bonded panels, other than cement bonded
definition: Other mineral bonded panels, other than cement bonded
in scheme: Forest Products Classification and Definitions (FPC&D) v2022
notation: 077.29

Thermoplastic bonded panels
type: Concept
broader: Other panels based on wood or other ligno-cellulosic materials
definition: Panels manufactured from particles of wood, bagasse, straw or other ligno-cellulosic materials bonded with thermoplastic (PE, PP, PVC etc.)
in scheme: Forest Products Classification and Definitions (FPC&D) v2022
narrower: Thermoplastic bonded panels, wood-plastic composite
narrower: Other thermoplastic bonded panels
notation: 077.3

Thermoplastic bonded panels, wood-plastic composite
type: Concept
broader: Thermoplastic bonded panels
definition: Wood-plastic composite are composite materials made of wood fibre or wood flour and thermoplastic. They are produced by thoroughly mixing ground wood particles and heated thermoplastic resin. The most common method of production is to extrude the material into the desired shape.
in scheme: Forest Products Classification and Definitions (FPC&D) v2022
notation: 077.31

Other thermoplastic bonded panels
type: Concept
broader: Thermoplastic bonded panels
definition: These composite contain no cellulose-based fibre fillers such as pulp fibres, peanut hulls, bamboo, straw, digestate, etc.
in scheme: Forest Products Classification and Definitions (FPC&D) v2022
notation: 077.39

Other panels n.e.c.
type: Concept
broader: Other panels based on wood or other ligno-cellulosic materials
definition: Includes any panels not covered by definitions of the groups 077.1, 077.2, 077.3
in scheme: Forest Products Classification and Definitions (FPC&D) v2022
notation: 077.9

WOOD PULP
type: Concept
definition: Fibrous material prepared from pulpwood, wood chips, particles or residues by mechanical and/or chemical process for further manufacture into paper, paperboard, fibreboard or other cellulose products.
in scheme: Forest Products Classification and Definitions (FPC&D) v2022
narrower: Mechanical wood pulp
narrower: Dissolving wood pulp
narrower: Semi-chemical wood pulp
narrower: Chemical wood pulp
notation: 08
top concept of: Forest Products Classification and Definitions (FPC&D) v2022

Mechanical wood pulp
type: Concept
broader: WOOD PULP
definition: Wood pulp obtained by grinding or milling pulpwood or residues into fibres, or through refining chips or particles. It may be bleached or unbleached. It includes stone groundwood, pressurised stone groundwood, refiner mechanical pulp and thermo-mechanical pulp, It excludes exploded and defibrillated pulp
in scheme: Forest Products Classification and Definitions (FPC&D) v2022
narrower: Refiner mechanical pulp
narrower: Stone groundwood
narrower: Thermo-mechanical pulp
narrower: Pressurised stone groundwood
notation: 081.

Stone groundwood
type: Concept
broader: Mechanical wood pulp
definition: It is produced from roundwood or blocks in stone grinders at atmospheric pressure.
in scheme: Forest Products Classification and Definitions (FPC&D) v2022
narrower: Stone groundwood, bleached
narrower: Stone groundwood, unbleached
notation: 081.1

Stone groundwood, unbleached
type: Concept
broader: Stone groundwood
definition: Pulp not treated with chemicals to increase its brightness.
in scheme: Forest Products Classification and Definitions (FPC&D) v2022
narrower: Stone groundwood, unbleached, coniferous
narrower: Other unbleached stone groundwood
notation: 081.11

Stone groundwood, unbleached, coniferous
type: Concept
broader: Stone groundwood, unbleached
definition: N.A.
in scheme: Forest Products Classification and Definitions (FPC&D) v2022
notation: 081.111

Other unbleached stone groundwood
type: Concept
broader: Stone groundwood, unbleached
definition: N.A.
in scheme: Forest Products Classification and Definitions (FPC&D) v2022
notation: 081.119

Stone groundwood, bleached
type: Concept
broader: Stone groundwood
definition: Pulp treated with chemicals to increase its brightness.
in scheme: Forest Products Classification and Definitions (FPC&D) v2022
narrower: Stone groundwood, bleached, coniferous
narrower: Other bleached stone groundwood
notation: 081.12

Stone groundwood, bleached, coniferous
type: Concept
broader: Stone groundwood, bleached
definition: N.A.
in scheme: Forest Products Classification and Definitions (FPC&D) v2022
notation: 081.121

Other bleached stone groundwood
type: Concept
broader: Stone groundwood, bleached
definition: N.A.
in scheme: Forest Products Classification and Definitions (FPC&D) v2022
notation: 081.129

Pressurised stone groundwood
type: Concept
broader: Mechanical wood pulp
definition: It is produced from roundwood or blocks in pressurised stone grinders.
in scheme: Forest Products Classification and Definitions (FPC&D) v2022
narrower: Pressurised stone groundwood, unbleached
narrower: Pressurised stone groundwood, bleached
notation: 081.2

Pressurised stone groundwood, unbleached
type: Concept
broader: Pressurised stone groundwood
definition: Pulp not treated with chemicals to increase its brightness.
in scheme: Forest Products Classification and Definitions (FPC&D) v2022
narrower: Other unbleached pressurised stone groundwood
narrower: Pressurised stone groundwood, unbleached, coniferous
notation: 081.21

Pressurised stone groundwood, unbleached, coniferous
type: Concept
broader: Pressurised stone groundwood, unbleached
definition: N.A.
in scheme: Forest Products Classification and Definitions (FPC&D) v2022
notation: 081.211

Other unbleached pressurised stone groundwood
type: Concept
broader: Pressurised stone groundwood, unbleached
definition: N.A.
in scheme: Forest Products Classification and Definitions (FPC&D) v2022
notation: 081.219

Pressurised stone groundwood, bleached
type: Concept
broader: Pressurised stone groundwood
definition: Pulp treated with chemicals to increase its brightness.
in scheme: Forest Products Classification and Definitions (FPC&D) v2022
narrower: Pressurised stone groundwood, bleached, coniferous
narrower: Other bleached pressurised stone groundwood
notation: 081.22

Pressurised stone groundwood, bleached, coniferous
type: Concept
broader: Pressurised stone groundwood, bleached
definition: N.A.
in scheme: Forest Products Classification and Definitions (FPC&D) v2022
notation: 081.221

Other bleached pressurised stone groundwood
type: Concept
broader: Pressurised stone groundwood, bleached
definition: N.A.
in scheme: Forest Products Classification and Definitions (FPC&D) v2022
notation: 081.229

Refiner mechanical pulp
type: Concept
broader: Mechanical wood pulp
definition: It is produced from wood chips or wafers in refiners discharging at atmospheric pressure.
in scheme: Forest Products Classification and Definitions (FPC&D) v2022
narrower: Refiner mechanical pulp, bleached
narrower: Refiner mechanical pulp, unbleached
notation: 081.3

Refiner mechanical pulp, unbleached
type: Concept
broader: Refiner mechanical pulp
definition: Pulp not treated with chemicals to increase its brightness.
in scheme: Forest Products Classification and Definitions (FPC&D) v2022
narrower: Other unbleached refiner mechanical pulp
narrower: Refiner mechanical pulp, unbleached, coniferous
notation: 081.31

Refiner mechanical pulp, unbleached, coniferous
type: Concept
broader: Refiner mechanical pulp, unbleached
definition: N.A.
in scheme: Forest Products Classification and Definitions (FPC&D) v2022
notation: 081.311

Other unbleached refiner mechanical pulp
type: Concept
broader: Refiner mechanical pulp, unbleached
definition: N.A.
in scheme: Forest Products Classification and Definitions (FPC&D) v2022
notation: 081.319

Refiner mechanical pulp, bleached
type: Concept
broader: Refiner mechanical pulp
definition: Pulp treated with chemicals to increase its brightness.
in scheme: Forest Products Classification and Definitions (FPC&D) v2022
narrower: Refiner mechanical pulp, bleached, coniferous
narrower: Other bleached refiner mechanical pulp
notation: 081.32

Refiner mechanical pulp, bleached, coniferous
type: Concept
broader: Refiner mechanical pulp, bleached
definition: N.A.
in scheme: Forest Products Classification and Definitions (FPC&D) v2022
notation: 081.321

Other bleached refiner mechanical pulp
type: Concept
broader: Refiner mechanical pulp, bleached
definition: N.A.
in scheme: Forest Products Classification and Definitions (FPC&D) v2022
notation: 081.329

Thermo-mechanical pulp
type: Concept
broader: Mechanical wood pulp
definition: It is produced from wood chips or wafers in refiners discharging after high-pressure steaming of the wood.
in scheme: Forest Products Classification and Definitions (FPC&D) v2022
narrower: Thermo-mechanical pulp, bleached
narrower: Thermo-mechanical pulp, unbleached
notation: 081.4

Thermo-mechanical pulp, unbleached
type: Concept
broader: Thermo-mechanical pulp
definition: Pulp not treated with chemicals to increase its brightness.
in scheme: Forest Products Classification and Definitions (FPC&D) v2022
narrower: Thermo-mechanical pulp, unbleached, coniferous
narrower: Other unbleached thermo-mechanical pulp
notation: 081.41

Thermo-mechanical pulp, unbleached, coniferous
type: Concept
broader: Thermo-mechanical pulp, unbleached
definition: N.A.
in scheme: Forest Products Classification and Definitions (FPC&D) v2022
notation: 081.411

Other unbleached thermo-mechanical pulp
type: Concept
broader: Thermo-mechanical pulp, unbleached
definition: N.A.
in scheme: Forest Products Classification and Definitions (FPC&D) v2022
notation: 081.419

Thermo-mechanical pulp, bleached
type: Concept
broader: Thermo-mechanical pulp
definition: Pulp treated with chemicals to increase its brightness.
in scheme: Forest Products Classification and Definitions (FPC&D) v2022
narrower: Thermo-mechanical pulp, bleached, coniferous
narrower: Other bleached thermo-mechanical pulp
notation: 081.42

Thermo-mechanical pulp, bleached, coniferous
type: Concept
broader: Thermo-mechanical pulp, bleached
definition: N.A.
in scheme: Forest Products Classification and Definitions (FPC&D) v2022
notation: 081.421

Other bleached thermo-mechanical pulp
type: Concept
broader: Thermo-mechanical pulp, bleached
definition: N.A.
in scheme: Forest Products Classification and Definitions (FPC&D) v2022
notation: 081.429

Semi-chemical wood pulp
type: Concept
broader: WOOD PULP
definition: Wood pulp obtained by subjecting pulpwood, wood chips, particles or residues to a series of mechanical and chemical treatments, none of which alone is sufficient to make the fibres separate readily. It may be bleached or unbleached.
in scheme: Forest Products Classification and Definitions (FPC&D) v2022
narrower: Semi-chemical pulp
narrower: Chemi-mechanical pulp
notation: 082.

Semi-chemical pulp
type: Concept
broader: Semi-chemical wood pulp
definition: Semi-chemical pulp is produced in a two-part process in which the wood, is first chemically softened in digesters and then mechanically refined. It is used mainly for medium-quality papers.
in scheme: Forest Products Classification and Definitions (FPC&D) v2022
narrower: Semi-chemical pulp, unbleached
narrower: Semi-chemical pulp, bleached
notation: 082.1

Semi-chemical pulp, unbleached
type: Concept
broader: Semi-chemical pulp
definition: Pulp not treated with chemicals to increase its brightness.
in scheme: Forest Products Classification and Definitions (FPC&D) v2022
narrower: Semi-chemical pulp, unbleached, coniferous
narrower: Other unbleached semi-chemical pulp
notation: 082.11

Semi-chemical pulp, unbleached, coniferous
type: Concept
broader: Semi-chemical pulp, unbleached
definition: N.A.
in scheme: Forest Products Classification and Definitions (FPC&D) v2022
notation: 082.111

Other unbleached semi-chemical pulp
type: Concept
broader: Semi-chemical pulp, unbleached
definition: N.A.
in scheme: Forest Products Classification and Definitions (FPC&D) v2022
notation: 082.119

Semi-chemical pulp, bleached
type: Concept
broader: Semi-chemical pulp
definition: Pulp treated with chemicals to increase its brightness.
in scheme: Forest Products Classification and Definitions (FPC&D) v2022
narrower: Semi-chemical pulp, bleached, coniferous
narrower: Other bleached semi-chemical pulp
notation: 082.12

Semi-chemical pulp, bleached, coniferous
type: Concept
broader: Semi-chemical pulp, bleached
definition: N.A.
in scheme: Forest Products Classification and Definitions (FPC&D) v2022
notation: 082.121

Other bleached semi-chemical pulp
type: Concept
broader: Semi-chemical pulp, bleached
definition: N.A.
in scheme: Forest Products Classification and Definitions (FPC&D) v2022
notation: 082.129

Chemi-mechanical pulp
type: Concept
broader: Semi-chemical wood pulp
definition: Chemi-mechanical pulp is produced in refiners from wood in chips, shavings, sawdust, etc. The wood is reduced to a fibrous state by the abrasive action. Small amounts of chemicals are introduced as a pre-treatment or during refining in order to facilitate fibre separation.
in scheme: Forest Products Classification and Definitions (FPC&D) v2022
narrower: Chemi-mechanical pulp, unbleached
narrower: Chemi-mechanical pulp, bleached
notation: 082.2

Chemi-mechanical pulp, unbleached
type: Concept
broader: Chemi-mechanical pulp
definition: Pulp not treated with chemicals to increase its brightness.
in scheme: Forest Products Classification and Definitions (FPC&D) v2022
narrower: Other unbleached chemi-mechanical pulp
narrower: Chemi-mechanical pulp, unbleached, coniferous
notation: 082.21

Chemi-mechanical pulp, unbleached, coniferous
type: Concept
broader: Chemi-mechanical pulp, unbleached
definition: N.A.
in scheme: Forest Products Classification and Definitions (FPC&D) v2022
notation: 082.211

Other unbleached chemi-mechanical pulp
type: Concept
broader: Chemi-mechanical pulp, unbleached
definition: N.A.
in scheme: Forest Products Classification and Definitions (FPC&D) v2022
notation: 082.219

Chemi-mechanical pulp, bleached
type: Concept
broader: Chemi-mechanical pulp
definition: Pulp treated with chemicals to increase its brightness.
in scheme: Forest Products Classification and Definitions (FPC&D) v2022
narrower: Chemi-mechanical pulp, bleached, coniferous
narrower: Other bleached chemi-mechanical pulp
notation: 082.22

Chemi-mechanical pulp, bleached, coniferous
type: Concept
broader: Chemi-mechanical pulp, bleached
definition: N.A.
in scheme: Forest Products Classification and Definitions (FPC&D) v2022
notation: 082.221

Other bleached chemi-mechanical pulp
type: Concept
broader: Chemi-mechanical pulp, bleached
definition: N.A.
in scheme: Forest Products Classification and Definitions (FPC&D) v2022
notation: 082.229

Chemical wood pulp
type: Concept
broader: WOOD PULP
definition: Wood pulp obtained by subjecting pulpwood, wood chips, particles or residues to a series of chemical treatments. It may be bleached, semi-bleached or unbleached. It excludes dissolving grades of wood pulp.
in scheme: Forest Products Classification and Definitions (FPC&D) v2022
narrower: Sulphite chemical wood pulp
narrower: Soda or sulphate chemical wood pulp
notation: 083.

Soda or sulphate chemical wood pulp
type: Concept
broader: Chemical wood pulp
definition: Wood pulp obtained by mechanically reducing pulpwood, wood chips, particles or residues to small pieces that are subsequently cooked in a pressure vessel in the presence of sodium hydroxide cooking liquor (soda pulp) or a mixture of sodium hydroxide and sodium sulphite cooking liquor (sulphate pulp). It is used in the manufacture of absorbent products as well as for papers and paperboards requiring high tearing resistance and tensile and bursting strength.
in scheme: Forest Products Classification and Definitions (FPC&D) v2022
narrower: Soda or sulphate chemical wood pulp, unbleached
narrower: Soda or sulphate chemical wood pulp, bleached or semi-bleached
notation: 083.1

Soda or sulphate chemical wood pulp, unbleached
type: Concept
broader: Soda or sulphate chemical wood pulp
definition: Pulp not treated with chemicals to increase its brightness.
in scheme: Forest Products Classification and Definitions (FPC&D) v2022
narrower: Soda or sulphate chemical wood pulp, unbleached, coniferous
narrower: Other unbleached soda or sulphate chemical wood pulp
notation: 083.11

Soda or sulphate chemical wood pulp, unbleached, coniferous
type: Concept
broader: Soda or sulphate chemical wood pulp, unbleached
definition: N.A.
in scheme: Forest Products Classification and Definitions (FPC&D) v2022
notation: 083.111

Other unbleached soda or sulphate chemical wood pulp
type: Concept
broader: Soda or sulphate chemical wood pulp, unbleached
definition: N.A.
in scheme: Forest Products Classification and Definitions (FPC&D) v2022
notation: 083.119

Soda or sulphate chemical wood pulp, bleached or semi-bleached
type: Concept
broader: Soda or sulphate chemical wood pulp
definition: Pulp treated with chemicals to increase its brightness.
in scheme: Forest Products Classification and Definitions (FPC&D) v2022
narrower: Soda or sulphate chemical wood pulp, bleached or semi-bleached, coniferous
narrower: Other bleached or semi-bleached soda or sulphate chemical wood pulp
notation: 083.12

Soda or sulphate chemical wood pulp, bleached or semi-bleached, coniferous
type: Concept
broader: Soda or sulphate chemical wood pulp, bleached or semi-bleached
definition: N.A.
in scheme: Forest Products Classification and Definitions (FPC&D) v2022
notation: 083.121

Other bleached or semi-bleached soda or sulphate chemical wood pulp
type: Concept
broader: Soda or sulphate chemical wood pulp, bleached or semi-bleached
definition: N.A.
in scheme: Forest Products Classification and Definitions (FPC&D) v2022
notation: 083.129

Sulphite chemical wood pulp
type: Concept
broader: Chemical wood pulp
definition: Wood pulp obtained by mechanically reducing pulpwood, wood chips, particles or residues to small pieces that are subsequently cooked in a pressure vessel in the presence of a bisulphite cooking liquor. Bisulphites such as ammonium, calcium, magnesium and sodium are commonly used in this process. The process is used extensively for the treatment of spruce fibre. It is used alone or mixed with other pulps, for various writing or printing papers, etc.
in scheme: Forest Products Classification and Definitions (FPC&D) v2022
narrower: Sulphite chemical wood pulp, unbleached
narrower: Sulphite chemical wood pulp, bleached or semi-bleached
notation: 083.2

Sulphite chemical wood pulp, unbleached
type: Concept
broader: Sulphite chemical wood pulp
definition: Pulp not treated with chemicals to increase its brightness.
in scheme: Forest Products Classification and Definitions (FPC&D) v2022
narrower: Sulphite chemical wood pulp, unbleached, coniferous
narrower: Other unbleached sulphite chemical wood pulp
notation: 083.21

Sulphite chemical wood pulp, unbleached, coniferous
type: Concept
broader: Sulphite chemical wood pulp, unbleached
definition: N.A.
in scheme: Forest Products Classification and Definitions (FPC&D) v2022
notation: 083.211

Other unbleached sulphite chemical wood pulp
type: Concept
broader: Sulphite chemical wood pulp, unbleached
definition: N.A.
in scheme: Forest Products Classification and Definitions (FPC&D) v2022
notation: 083.219

Sulphite chemical wood pulp, bleached or semi-bleached
type: Concept
broader: Sulphite chemical wood pulp
definition: Pulp treated with chemicals to increase its brightness.
in scheme: Forest Products Classification and Definitions (FPC&D) v2022
narrower: Other bleached or semi-bleached sulphite chemical wood pulp
narrower: Sulphite chemical wood pulp, bleached or semi-bleached, coniferous
notation: 083.22

Sulphite chemical wood pulp, bleached or semi-bleached, coniferous
type: Concept
broader: Sulphite chemical wood pulp, bleached or semi-bleached
definition: N.A.
in scheme: Forest Products Classification and Definitions (FPC&D) v2022
notation: 083.221

Other bleached or semi-bleached sulphite chemical wood pulp
type: Concept
broader: Sulphite chemical wood pulp, bleached or semi-bleached
definition: N.A.
in scheme: Forest Products Classification and Definitions (FPC&D) v2022
notation: 083.229

Dissolving wood pulp
type: Concept
broader: WOOD PULP
definition: Chemical pulp (sulphate, soda or sulphite) made from wood of special quality, with a very high alpha-cellulose content (usually 90 % and over). This type of pulp is always bleached and is specially refined or purified to meet requirements of its intended use. It is used for making regenerated cellulose, cellulose ethers and esters and products of these materials, such as plates, sheets, film, foil and strip, textile fibres and certain papers (filter paper, vegetable parchment, … )
in scheme: Forest Products Classification and Definitions (FPC&D) v2022
narrower: Sulphate dissolving wood pulp
narrower: Sulphite dissolving wood pulp
notation: 084.

Sulphate dissolving wood pulp
type: Concept
broader: Dissolving wood pulp
definition: Dissolving grade wood pulp obtained by use of the sulphate and soda process (description in the group 083.1).
in scheme: Forest Products Classification and Definitions (FPC&D) v2022
narrower: Sulphate dissolving wood pulp, coniferous
narrower: Other sulphate dissolving wood pulp
notation: 084.1

Sulphate dissolving wood pulp, coniferous
type: Concept
broader: Sulphate dissolving wood pulp
definition: N.A.
in scheme: Forest Products Classification and Definitions (FPC&D) v2022
notation: 084.11

Other sulphate dissolving wood pulp
type: Concept
broader: Sulphate dissolving wood pulp
definition: N.A.
in scheme: Forest Products Classification and Definitions (FPC&D) v2022
notation: 084.19

Sulphite dissolving wood pulp
type: Concept
broader: Dissolving wood pulp
definition: Dissolving grade wood pulp obtained by use of the sulphite process (description in the group 083.2).
in scheme: Forest Products Classification and Definitions (FPC&D) v2022
narrower: Sulphite dissolving wood pulp, coniferous
narrower: Other sulphite dissolving wood pulp
notation: 084.2

Sulphite dissolving wood pulp, coniferous
type: Concept
broader: Sulphite dissolving wood pulp
definition: N.A.
in scheme: Forest Products Classification and Definitions (FPC&D) v2022
notation: 084.21

Other sulphite dissolving wood pulp
type: Concept
broader: Sulphite dissolving wood pulp
definition: N.A.
in scheme: Forest Products Classification and Definitions (FPC&D) v2022
notation: 084.29

OTHER PULP
type: Concept
definition: Includes pulp, except dissolving grades, obtained by any method from fibrous ligno-cellulosic materials, except wood. It may be unbleached or bleached.
in scheme: Forest Products Classification and Definitions (FPC&D) v2022
narrower: Recovered fibre pulp
narrower: Pulp from fibres other than wood
notation: 09
top concept of: Forest Products Classification and Definitions (FPC&D) v2022

Pulp from fibres other than wood
type: Concept
broader: OTHER PULP
definition: Pulp manufactured from fibrous vegetable materials other than wood and used for the manufacture of paper, paperboard, fibreboard and other uses. It excludes pulp made from recovered paper. It includes pulps made from: straw; bamboo; bagasse; esparto; other reeds or grasses; cotton fibres; flax; hemp; rags; and other textile wastes.
in scheme: Forest Products Classification and Definitions (FPC&D) v2022
notation: 091.

Recovered fibre pulp
type: Concept
broader: OTHER PULP
definition: Pulp manufactured from recovered paper or paperboard and used for the manufacture of paper, paperboard and fibreboard. It excludes pulp made from straw; bamboo; bagasse; esparto; other reeds or grasses; cotton fibres; flax; hemp; rags; and other textile wastes. It may be unbleached or bleached.
in scheme: Forest Products Classification and Definitions (FPC&D) v2022
narrower: Unbleached kraft paper or paperboard or corrugated paper or paperboard
narrower: Pulps of fibres derived from recovered (waste and scrap) paper or paperboard
notation: 092.

Pulps of fibres derived from recovered (waste and scrap) paper or paperboard
type: Concept
broader: Recovered fibre pulp
definition: Pulps of fibres derived from recovered (waste and scrap) paper or paperboard used for the manufacture of paper, paperboard and fibreboard.
in scheme: Forest Products Classification and Definitions (FPC&D) v2022
narrower: Pulps of fibres derived from recovered (waste and scrap) paper or paperboard, unbleached
narrower: Pulps of fibres derived from recovered (waste and scrap) paper or paperboard, bleached
notation: 092.1

Pulps of fibres derived from recovered (waste and scrap) paper or paperboard, unbleached
type: Concept
broader: Pulps of fibres derived from recovered (waste and scrap) paper or paperboard
definition: Pulp not treated with chemicals to increase its brightness.
in scheme: Forest Products Classification and Definitions (FPC&D) v2022
notation: 092.11

Pulps of fibres derived from recovered (waste and scrap) paper or paperboard, bleached
type: Concept
broader: Pulps of fibres derived from recovered (waste and scrap) paper or paperboard
definition: Pulp treated with chemicals to increase its brightness.
in scheme: Forest Products Classification and Definitions (FPC&D) v2022
notation: 092.12

RECOVERED PAPER
type: Concept
definition: Waste and scraps of paper or paperboard that have been collected for re-use or trade. It includes paper and paperboard that has been used for its original purpose and residues from paper and paperboard production.
in scheme: Forest Products Classification and Definitions (FPC&D) v2022
narrower: Paper or paperboard made mainly of mechanical pulp (newspapers, journals and similar)
narrower: Other, including unsorted waste and scrap
narrower: Other paper or paperboard made mainly of bleached chemical pulp, not coloured in the mass
notation: 10
top concept of: Forest Products Classification and Definitions (FPC&D) v2022

Unbleached kraft paper or paperboard or corrugated paper or paperboard
type: Concept
broader: Recovered fibre pulp
definition: Unbleached kraft paper or paperboard or corrugated paper or paperboard
in scheme: Forest Products Classification and Definitions (FPC&D) v2022
notation: 101.

Other paper or paperboard made mainly of bleached chemical pulp, not coloured in the mass
type: Concept
broader: RECOVERED PAPER
definition: Other paper or paperboard made mainly of bleached chemical pulp, not coloured in the mass
in scheme: Forest Products Classification and Definitions (FPC&D) v2022
notation: 102.

Paper or paperboard made mainly of mechanical pulp (newspapers, journals and similar)
type: Concept
broader: RECOVERED PAPER
definition: Paper or paperboard made mainly of mechanical pulp (newspapers, journals and similar)
in scheme: Forest Products Classification and Definitions (FPC&D) v2022
notation: 103.

Other, including unsorted waste and scrap
type: Concept
broader: RECOVERED PAPER
definition: Other, including unsorted waste and scrap
in scheme: Forest Products Classification and Definitions (FPC&D) v2022
notation: 109.

PAPER AND PAPERBOARD
type: Concept
definition: The paper and paperboard category is an aggregate category. In the production and trade statistics, it represents the sum of graphic papers; sanitary and household papers; packaging materials and other paper and paperboard. It excludes manufactured paper products such as boxes, cartons, books and magazines, etc.
in scheme: Forest Products Classification and Definitions (FPC&D) v2022
narrower: Sanitary and household papers
narrower: Packaging materials
narrower: Other paper and paperboard
narrower: Graphic papers
notation: 11
top concept of: Forest Products Classification and Definitions (FPC&D) v2022

Graphic papers
type: Concept
broader: PAPER AND PAPERBOARD
definition: The graphic papers category is an aggregate category. It represents the sum of newsprint; uncoated mechanical; uncoated woodfree and coated papers. Products in this category are generally manufactured in strips or rolls of a width exceeding 15 cm or in rectangular sheets with one side exceeding 36 cm and the other exceeding 15 cm in the unfolded state. It excludes manufactured paper products such as books and magazines, etc.
in scheme: Forest Products Classification and Definitions (FPC&D) v2022
narrower: Coated graphic papers
narrower: Uncoated graphic papers
narrower: Newsprint
notation: 111.

Newsprint
type: Concept
broader: Graphic papers
definition: Uncoated paper mainly used for printing newspapers. It is made largely from mechanical pulp and/or recovered paper, with or without a small amount of filler. Products in this category are generally manufactured in strips or rolls of a width exceeding 36 cm. Weights usually range from 40 to 52 g/m2 but can be as high as 65 g/m2. Newsprint is machine finished or slightly calendered, white or slightly coloured and is used in reels for letterpress, offset or flexo printing.
in scheme: Forest Products Classification and Definitions (FPC&D) v2022
notation: 111.1

Uncoated graphic papers
type: Concept
broader: Graphic papers
definition: Paper and paperboard, except newsprint, that may have been subjected to sizing, calendering, super-calendering, glazing, water marking or similar simple finishing processes, but not to coating.
in scheme: Forest Products Classification and Definitions (FPC&D) v2022
narrower: Uncoated graphic papers, mechanical
narrower: Uncoated graphic papers, wood free
notation: 111.2

Uncoated graphic papers, mechanical
type: Concept
broader: Uncoated graphic papers
definition: Paper and paperboard containing 10 % or more fibres obtained by mechanical or thermo-mechanical process.
in scheme: Forest Products Classification and Definitions (FPC&D) v2022
notation: 111.21

Uncoated graphic papers, wood free
type: Concept
broader: Uncoated graphic papers
definition: Paper and paperboard not containing 10 % or more fibres obtained by mechanical or thermo-mechanical process.
in scheme: Forest Products Classification and Definitions (FPC&D) v2022
narrower: Uncoated graphic papers, wood free, hand-made paper and paperboard
narrower: Uncoated graphic papers, wood free, used as a base for photo-sensitive, heat-sensitive or electro-sensitive paper or paperboard
narrower: Other wood free uncoated graphic papers
notation: 111.22

Uncoated graphic papers, wood free, hand-made paper and paperboard
type: Concept
broader: Uncoated graphic papers, wood free
definition: Hand-made paper and paperboard can be made from any paper-making material but mainly are used best grade linen or cotton rags. The term “hand-made” means that moulding the pulp fibres into sheet form is performed by hand.
in scheme: Forest Products Classification and Definitions (FPC&D) v2022
notation: 111.221

Uncoated graphic papers, wood free, used as a base for photo-sensitive, heat-sensitive or electro-sensitive paper or paperboard
type: Concept
broader: Uncoated graphic papers, wood free
definition: Paper and paperboard used as a base for photo-sensitive, heat-sensitive or electro-sensitive paper or paperboard.
in scheme: Forest Products Classification and Definitions (FPC&D) v2022
notation: 111.222

Other wood free uncoated graphic papers
type: Concept
broader: Uncoated graphic papers, wood free
definition: Other wood free paper and paperboard.
in scheme: Forest Products Classification and Definitions (FPC&D) v2022
notation: 111.229

Coated graphic papers
type: Concept
broader: Graphic papers
definition: Paper and paperboard which has been coated on one or both sides by a compound or polymer to impart certain qualities to the paper, including weight, surface gloss, smoothness or reduced ink absorbency.
in scheme: Forest Products Classification and Definitions (FPC&D) v2022
narrower: Coated graphic papers, mechanical
narrower: Coated graphic papers, woodfree
notation: 111.3

Coated graphic papers, mechanical
type: Concept
broader: Coated graphic papers
definition: Coated paper and paperboard containing 10 % or more fibres obtained by mechanical or thermo-mechanical process.
in scheme: Forest Products Classification and Definitions (FPC&D) v2022
narrower: Other mechanical coated graphic papers
narrower: Coated graphic papers, mechanical, light-weight coated paper
notation: 111.31

Coated graphic papers, mechanical, light-weight coated paper
type: Concept
broader: Coated graphic papers, mechanical
definition: Light-weight coated paper is a coated paper with a high mechanical pulp content. They are used for high quality magazines and advertising materials with demanding colour-printing requirements.
in scheme: Forest Products Classification and Definitions (FPC&D) v2022
notation: 111.311

Other mechanical coated graphic papers
type: Concept
broader: Coated graphic papers, mechanical
definition: Other mechanical coated papers.
in scheme: Forest Products Classification and Definitions (FPC&D) v2022
notation: 111.319

Coated graphic papers, woodfree
type: Concept
broader: Coated graphic papers
definition: Coated paper and paperboard not containing 10 % or more fibres obtained by mechanical or thermo-mechanical process.
in scheme: Forest Products Classification and Definitions (FPC&D) v2022
narrower: Coated graphic papers, woodfree, carbon paper, self-copy paper and other copying or transfer papers
narrower: Other wood free coated graphic papers
notation: 111.32

Coated graphic papers, woodfree, carbon paper, self-copy paper and other copying or transfer papers
type: Concept
broader: Coated graphic papers, woodfree
definition: Papers coated on one side with a layer of a loosely bound dry ink or pigmented coating, bound with wax, used for making one or more copies simultaneously with the creation of an original document by applying pressure (using a typewriter or a ballpoint pen). These products must be in strips or rolls of a width exceeding 36 cm.
in scheme: Forest Products Classification and Definitions (FPC&D) v2022
notation: 111.321

Other wood free coated graphic papers
type: Concept
broader: Coated graphic papers, woodfree
definition: Other wood free coated graphic papers n.e.c.
in scheme: Forest Products Classification and Definitions (FPC&D) v2022
notation: 111.329

Sanitary and household papers
type: Concept
broader: PAPER AND PAPERBOARD
definition: This covers the stock of a wide range of tissue and other hygienic papers for use in households or commercial and industrial premises. Products in this category are generally manufactured in strips or rolls of a width exceeding 36 cm. Examples are toilet paper and facial tissues, kitchen towels, hand towels and industrial wipes. Some tissue is also used in the manufacture of baby napkins, sanitary towels, etc. The parent reel stock is made from virgin pulp or recovered fibre or mixtures of these.
in scheme: Forest Products Classification and Definitions (FPC&D) v2022
narrower: Toilet or facial tissue stock, towel or napkin stock and similar papers
narrower: Cellulose wadding and webs of cellulose fibres
narrower: Other sanitary and household papers
notation: 112.

Toilet or facial tissue stock, towel or napkin stock and similar papers
type: Concept
broader: Sanitary and household papers
definition: Toilet or facial tissue stock, towel or napkin stock and similar paper of a kind used for household or sanitary purposes.
in scheme: Forest Products Classification and Definitions (FPC&D) v2022
notation: 112.1

Cellulose wadding and webs of cellulose fibres
type: Concept
broader: Sanitary and household papers
definition: Cellulose wadding consists of creped web of cellulose fibres of open formation. Webs of cellulose fibres (tissues) consist of cellulose fibres of closed formation.
in scheme: Forest Products Classification and Definitions (FPC&D) v2022
notation: 112.2

Other sanitary and household papers
type: Concept
broader: Sanitary and household papers
definition: Other sanitary and household papers n.e.c.
in scheme: Forest Products Classification and Definitions (FPC&D) v2022
notation: 112.9

Packaging materials
type: Concept
broader: PAPER AND PAPERBOARD
definition: Paper or paperboard mainly used for wrapping and packaging purposes. Products in this category are generally manufactured in strips or rolls of a width exceeding 36 cm. It excludes unbleached kraft paper and paperboard that are not sack kraft paper or Kraftliner and weighing more than 150 g/m² but less than 225 g/m²; felt paper and paperboard; tracing papers; not further processed uncoated paper weighing 225 g/m² or more.
in scheme: Forest Products Classification and Definitions (FPC&D) v2022
narrower: Case materials
narrower: Wrapping papers
narrower: Cartonboard
narrower: Other papers mainly for packaging
notation: 113.

Case materials
type: Concept
broader: Packaging materials
definition: Papers and boards mainly used in the manufacture of corrugated board. They are made from any combination of virgin and recovered fibres and can be bleached, unbleached or mottled. It includes kraftliner, testliner, semi-chemical fluting, and waste-based fluting (Wellenstoff).
in scheme: Forest Products Classification and Definitions (FPC&D) v2022
narrower: Case materials, kraftliner
narrower: Case materials, fluting paper
narrower: Case materials, testliner (recycled liner board)
narrower: Other case materials
notation: 113.1

Case materials, kraftliner
type: Concept
broader: Case materials
definition: Paper or paperboard in rolls whose fibre content has no less than 80% fibers obtained by the chemical sulfate or soda processes and weighing more than 115 g/m2.
in scheme: Forest Products Classification and Definitions (FPC&D) v2022
narrower: Case materials, kraftliner, unbleached
narrower: Case materials, kraftliner, bleached
notation: 113.11

Case materials, kraftliner, unbleached
type: Concept
broader: Case materials, kraftliner
definition: Kraftliner made wholly or principally of unbleached sulphate pulp.
in scheme: Forest Products Classification and Definitions (FPC&D) v2022
notation: 113.111

Case materials, kraftliner, bleached
type: Concept
broader: Case materials, kraftliner
definition: Kraftliner made wholly or principally of bleached sulphate pulp.
in scheme: Forest Products Classification and Definitions (FPC&D) v2022
notation: 113.112

Case materials, fluting paper
type: Concept
broader: Case materials
definition: Paper or paperboard used mainly as a corrugating medium in the production of corrugated board. It may be produced wholly or principally from semi-chemical wood pulp or from other materials.
in scheme: Forest Products Classification and Definitions (FPC&D) v2022
narrower: Case materials, fluting paper, straw fluting paper
narrower: Case materials, fluting paper, semi-chemical
narrower: Other fluting papers
notation: 113.12

Case materials, fluting paper, semi-chemical
type: Concept
broader: Case materials, fluting paper
definition: Fluting paper made wholly or principally of semi-chemical woodpulp.
in scheme: Forest Products Classification and Definitions (FPC&D) v2022
notation: 113.121

Case materials, fluting paper, straw fluting paper
type: Concept
broader: Case materials, fluting paper
definition: Paper, in rolls, made mainly of straw pulp obtained by semi-chemical pulping processes and weighing 130 g/m2 or more.
in scheme: Forest Products Classification and Definitions (FPC&D) v2022
notation: 113.122

Other fluting papers
type: Concept
broader: Case materials, fluting paper
definition: Fluting paper made wholly or principally from other than semi-chemical woodpulp.
in scheme: Forest Products Classification and Definitions (FPC&D) v2022
notation: 113.129

Case materials, testliner (recycled liner board)
type: Concept
broader: Case materials
definition: Testliner, like kraftliner, is used for the outer and intermediate plies of corrugated board. However, its strength is not quite as high as that of kraftliner, as it has a higher recycled fibre content.
in scheme: Forest Products Classification and Definitions (FPC&D) v2022
notation: 113.13

Other case materials
type: Concept
broader: Case materials
definition: Other case materials not mention in subgroups 11311, 11312 and 11313.
in scheme: Forest Products Classification and Definitions (FPC&D) v2022
notation: 113.19

Cartonboard
type: Concept
broader: Packaging materials
definition: Sometimes referred to as folding boxboard, it may be single- or multi-ply, coated or uncoated. It is made from virgin and/or recovered fibres, and has good folding properties, stiffness and scoring ability. It is mainly used in cartons for consumer products such as frozen food and for liquid containers. It includes paper and paperboard covered or coated with plastics (excluding adhesives) and coated multi-ply.
in scheme: Forest Products Classification and Definitions (FPC&D) v2022
narrower: Cartonboard, kraftpaper paper and paperboard not used for writing weighing more than 150 g/m² but less than 225 g/m²
narrower: Cartonboard, other uncoated paper and paperboard weighing more than 150 g/m² but less than 225 g/m²
narrower: Cartonboard, paper and paperboard coated, impregnated or covered with plastics (excluding adhesives) weighing more than 150 g/m²
narrower: Cartonboard, other kraft paper and paperboard weighing 225 g/m² or more
narrower: Other cartonboard n.e.c.
notation: 113.2

Cartonboard, kraftpaper paper and paperboard not used for writing weighing more than 150 g/m² but less than 225 g/m²
type: Concept
broader: Cartonboard
definition: Kraftpaper paper or paperboard (cardboard) are produced from chemical pulp produced in the kraft process, which means that not less than 80 % by weight of the total fibre content consists of fibres obtained by the chemical sulphate or soda processes.
in scheme: Forest Products Classification and Definitions (FPC&D) v2022
notation: 113.21

Cartonboard, other uncoated paper and paperboard weighing more than 150 g/m² but less than 225 g/m²
type: Concept
broader: Cartonboard
definition: Other uncoated paper and paperboard weighing more than 150 g/m² but less than 225 g/m² in rolls or sheets, not further worked or processed. (4805.92)
in scheme: Forest Products Classification and Definitions (FPC&D) v2022
notation: 113.22

Cartonboard, paper and paperboard coated, impregnated or covered with plastics (excluding adhesives) weighing more than 150 g/m²
type: Concept
broader: Cartonboard
definition: Paper and paperboard coated, impregnated or covered with plastics (excluding adhesives) weighing more than 150 g/m², if the layer of plastics does not constitute more than half the total thickness.
in scheme: Forest Products Classification and Definitions (FPC&D) v2022
notation: 113.23

Cartonboard, other kraft paper and paperboard weighing 225 g/m² or more
type: Concept
broader: Cartonboard
definition: Other kraft paper and paperboard weighing 225 g/m² or more, in rolls or sheets, can bleached or unbleached.
in scheme: Forest Products Classification and Definitions (FPC&D) v2022
notation: 113.24

Other cartonboard n.e.c.
type: Concept
broader: Cartonboard
definition: Other cartonboard not mentioned in the subgroups 113.21, 113.22, 113.23 and 113.24.
in scheme: Forest Products Classification and Definitions (FPC&D) v2022
notation: 113.29

Wrapping papers
type: Concept
broader: Packaging materials
definition: Wrappings papers (up to 150 g/m2) whose main use is wrapping or packaging made from any combination of virgin or recovered fibres, bleached or unbleached. They may be subject to various finishing and/or marking processes. It includes sack kraft, other wrapping krafts, sulphite and greaseproof papers as well as coated paper and paperboard not uniformly bleached throughout the mass, except multi-ply. It excludes: tracing papers.
in scheme: Forest Products Classification and Definitions (FPC&D) v2022
narrower: Wrapping papers, corrugated paper and paperboard
narrower: Wrapping papers, glassine and other glazed transparent or translucent papers
narrower: Wrapping papers, sack kraft paper
narrower: Wrapping papers, kraft paper and paperboard weighing 150 g/m² or less
narrower: Other wrapping papers n.e.c.
narrower: Wrapping papers, sulphite wrapping paper
narrower: Wrapping papers, vegetable parchment
narrower: Wrapping papers, greaseproof papers
narrower: Wrapping papers, kraft paper creped or crinkled
notation: 113.3

Wrapping papers, sack kraft paper
type: Concept
broader: Wrapping papers
definition: Sack kraft paper is a porous kraft paper with high elasticity and high tear resistance, designed for packaging products with high demands for strength and durability. It contains more than 80 % by weight fibres obtained by chemical sulphate or soda processes.
in scheme: Forest Products Classification and Definitions (FPC&D) v2022
narrower: Wrapping papers, sack kraft paper, unbleached
narrower: Wrapping papers, sack kraft paper, bleached
notation: 113.31

Wrapping papers, sack kraft paper, unbleached
type: Concept
broader: Wrapping papers, sack kraft paper
definition: Sack kraft paper made wholly or principally of unbleached sulphate pulp.
in scheme: Forest Products Classification and Definitions (FPC&D) v2022
notation: 113.311

Wrapping papers, sack kraft paper, bleached
type: Concept
broader: Wrapping papers, sack kraft paper
definition: N.A.
in scheme: Forest Products Classification and Definitions (FPC&D) v2022
notation: 113.312

Wrapping papers, kraft paper and paperboard weighing 150 g/m² or less
type: Concept
broader: Wrapping papers
definition: Kraftpaper paper and paperboard means paper and paperboard of which not less than 80 % by weight of the total fibre content consists of fibres obtained by the chemical sulphate or soda processes.
in scheme: Forest Products Classification and Definitions (FPC&D) v2022
narrower: Wrapping papers, kraft paper and paperboard weighing 150 g/m² or less, unbleached
narrower: Wrapping papers, kraft paper and paperboard weighing 150 g/m² or less, bleached
notation: 113.32

Wrapping papers, kraft paper and paperboard weighing 150 g/m² or less, unbleached
type: Concept
broader: Wrapping papers, kraft paper and paperboard weighing 150 g/m² or less
definition: Kraftpaper paper and paperboard made wholly or principally of unbleached sulphate pulp.
in scheme: Forest Products Classification and Definitions (FPC&D) v2022
notation: 113.321

Wrapping papers, kraft paper and paperboard weighing 150 g/m² or less, bleached
type: Concept
broader: Wrapping papers, kraft paper and paperboard weighing 150 g/m² or less
definition: Kraftpaper paper and paperboard made wholly or principally of bleached sulphate pulp.
in scheme: Forest Products Classification and Definitions (FPC&D) v2022
notation: 113.322

Wrapping papers, sulphite wrapping paper
type: Concept
broader: Wrapping papers
definition: Sulphite wrapping paper means machine-glazed paper. It contains more than 40 % by weight fibres obtained by chemical sulphite process.
in scheme: Forest Products Classification and Definitions (FPC&D) v2022
notation: 113.33

Wrapping papers, vegetable parchment
type: Concept
broader: Wrapping papers
definition: Vegetable parchment is made by passing sheets of paper made of pulp fibres into sulfuric acid. The sulfuric acid hydrolyses and solubilizes the main natural organic polymer, cellulose, present in the pulp wood fibres. The paper web is then washed in water, which stops the hydrolysis of the cellulose and causes a kind of cellulose coating to form on the paper. The final paper is dried and it is then resistant to grease and semi-translucent.
in scheme: Forest Products Classification and Definitions (FPC&D) v2022
notation: 113.34

Wrapping papers, greaseproof papers
type: Concept
broader: Wrapping papers
definition: Greaseproof papers are translucent papers that are impermeable to oil or grease and are normally used in cooking or food packaging. Normally greaseproof paper are produced by refining the paper stock and thus create a sheet with very low porosity.
in scheme: Forest Products Classification and Definitions (FPC&D) v2022
notation: 113.35

Wrapping papers, glassine and other glazed transparent or translucent papers
type: Concept
broader: Wrapping papers
definition: Glassine and other glazed transparent paper is made in the same manner as greaseproof paper but in the final stage they are supercalendered to further improve the density. They are mainly uncoloured and generally less impermeable than vegetable parchment and greaseproof papers.
in scheme: Forest Products Classification and Definitions (FPC&D) v2022
notation: 113.36

Wrapping papers, corrugated paper and paperboard
type: Concept
broader: Wrapping papers
definition: Corrugated paper and paperboard results from processing material through grooved rollers with the application of heat and steam. Flat surface sheet can be applied on one or both sides.
in scheme: Forest Products Classification and Definitions (FPC&D) v2022
notation: 113.37

Wrapping papers, kraft paper creped or crinkled
type: Concept
broader: Wrapping papers
definition: Creped and crinkled papers are made by mechanical treatment of the webs of paper in the moist state or by passing the made paper between rollers with wrinkled surfaces. The product has a wrinkled appearance and the property of high elasticity.
in scheme: Forest Products Classification and Definitions (FPC&D) v2022
notation: 113.38

Other wrapping papers n.e.c.
type: Concept
broader: Wrapping papers
definition: Other wrapping papers not mentioned in the subgroups 113.31, 113.32, 113.33, 113.34, 113.35, 113.36, 113.37 and 113.38.
in scheme: Forest Products Classification and Definitions (FPC&D) v2022
notation: 113.39

Other papers mainly for packaging
type: Concept
broader: Packaging materials
definition: This category embraces all papers and boards mainly for packaging purposes other than those listed above. Most are produced from recovered fibres, e.g. greyboards, and go for conversion, which in some cases may be for end-uses other than packaging.
in scheme: Forest Products Classification and Definitions (FPC&D) v2022
narrower: Other uncoated paper and paperboard weighing 225 g/m² or more
narrower: Other papers mainly for packaging n.e.c.
notation: 113.9

Other uncoated paper and paperboard weighing 225 g/m² or more
type: Concept
broader: Other papers mainly for packaging
definition: Other uncoated paper and paperboards weighing 225 g/m² or more, in rolls or sheets, and not further worked or processed.
in scheme: Forest Products Classification and Definitions (FPC&D) v2022
notation: 113.91

Other papers mainly for packaging n.e.c.
type: Concept
broader: Other papers mainly for packaging
definition: Other papers mainly for packaging n.e.c.
in scheme: Forest Products Classification and Definitions (FPC&D) v2022
notation: 113.99

Other paper and paperboard
type: Concept
broader: PAPER AND PAPERBOARD
definition: Other papers and paperboards for industrial and special purposes. It includes cigarette papers and stock of filter papers, as well as gypsum liners and special papers for insulating, roofing, and other specific applications or treatments; wallpaper base; unbleached kraft paper and paperboard that are not sack kraft paper or Kraftliner and weighing more than 150 g/m² but less than 225 g/m²; felt paper and paperboard; tracing papers; not further processed uncoated paper weighing 225 g/m² or more; and raw copying and transfer papers, in rolls or sheets except carbon or self-copy paper. It excludes all composite, not coated, paper and paper board of flat layers stuck together; coated paper and paperboard not uniformly bleached throughout the mass; and paper and paperboard covered or coated with plastics (excluding adhesives).
in scheme: Forest Products Classification and Definitions (FPC&D) v2022
narrower: Other paper and paperboard, wallpaper base
narrower: Other paper and paperboard, filter paper and paperboard
narrower: Other paper and paperboard, felt paper and paperboard
narrower: Other paper and paperboard, tracing papers
narrower: Other paper and paperboard, filter blocks, slabs and plates of paper pulp
narrower: Other paper and paperboard, cigarette paper
narrower: Other paper and paperboard n.e.c.
notation: 114.

Other paper and paperboard, wallpaper base
type: Concept
broader: Other paper and paperboard
definition: Uncoated paper of a kind used for further converting into acrylic or vinyl wallpapers.
in scheme: Forest Products Classification and Definitions (FPC&D) v2022
notation: 114.1

Other paper and paperboard, filter paper and paperboard
type: Concept
broader: Other paper and paperboard
definition: Filter paper and paperboard are porous products, devoid of wood fibres obtained by mechanical or semi-chemical process. They are designed to remove solid particles from liquids or gases. They are produced from rag or chemical pulp or a mixture of. It includes filter paper and paperboard not further worked or processed.
in scheme: Forest Products Classification and Definitions (FPC&D) v2022
notation: 114.2

Other paper and paperboard, felt paper and paperboard
type: Concept
broader: Other paper and paperboard
definition: Felt paper and paperboard are products made from a fibrous mass of varying degrees of absorbency. Waste and scrap of paper or paperboard and wood pulp or textile waste in the form of fibres are used in their manufacture. They are mainly used in the manufacture of paperboard for roofing.
in scheme: Forest Products Classification and Definitions (FPC&D) v2022
notation: 114.3

Other paper and paperboard, tracing papers
type: Concept
broader: Other paper and paperboard
definition: A form of tracing paper is similar to greaseproof paper. Tracing paper is usually made from sulphite pulp by reducing the fibres to a state of fine subdivision and hydrolysing them by very prolonged beating in water. Tracing paper is named as such for its ability for an image to be traced onto it.
in scheme: Forest Products Classification and Definitions (FPC&D) v2022
notation: 114.4

Other paper and paperboard, filter blocks, slabs and plates of paper pulp
type: Concept
broader: Other paper and paperboard
definition: Filter blocks, slabs and plates, of paper pulp are manufactured by using vegetable fibres (cotton, flax, wood, etc.) with a high cellulose content, which are compressed together in the form of blocks, slabs or plates without the aid of any binding material. Filter blocks are used in filters for clarifying liquids (e.g. wine, spirits, beer, vinegar, etc.)
in scheme: Forest Products Classification and Definitions (FPC&D) v2022
notation: 114.5

Other paper and paperboard, cigarette paper
type: Concept
broader: Other paper and paperboard
definition: This item cover all cigarette paper regardless of its size or presentation. This paper is of good quality (frequently of hemp or linen rag pulp), but very thin and relatively strong.
in scheme: Forest Products Classification and Definitions (FPC&D) v2022
notation: 114.6

Other paper and paperboard n.e.c.
type: Concept
broader: Other paper and paperboard
definition: Other paper and paperboards not mentioned in the divisions 111., 112., 113.
in scheme: Forest Products Classification and Definitions (FPC&D) v2022
notation: 114.9

CORK
type: Concept
definition: Cork is obtained almost exclusively from the outer bark of the cork-oak (Quercus suber).
in scheme: Forest Products Classification and Definitions (FPC&D) v2022
narrower: Agglomerated cork and articles of agglomerated cork
narrower: Natural cork
notation: 12
top concept of: Forest Products Classification and Definitions (FPC&D) v2022

Natural cork
type: Concept
broader: CORK
definition: Cork having undergone no treatment whatever after stripping.
in scheme: Forest Products Classification and Definitions (FPC&D) v2022
narrower: Articles of natural cork
narrower: Natural cork, debacked or roughly squared, or in rectangular blocks, plates, sheets or strip
narrower: Crushed, granulated or ground cork
narrower: Natural cork, raw or simply prepared
narrower: Waste of natural or agglomerated cork
notation: 121.

Natural cork, raw or simply prepared
type: Concept
broader: Natural cork
definition: Raw cork is presented in curved slabs as stripped from the cork tree. It includes cork which has been surface scraped or cleaned. It includes cork treated with fungicides or flattened by pressing after treatment in boiling water or stream. It excludes debacked cork (deprived of the outer bark), cork roughly squared
in scheme: Forest Products Classification and Definitions (FPC&D) v2022
notation: 121.1

Natural cork, debacked or roughly squared, or in rectangular blocks, plates, sheets or strip
type: Concept
broader: Natural cork
definition: Debacked cork are natural cork slabs with the whole of the back sawn or otherwise removed from the outer surface. Roughly squared cork are natural cork slabs with the outer (bark) and inner (tree) surfaces sawn or otherwise cut so as to be approximately parallel.
in scheme: Forest Products Classification and Definitions (FPC&D) v2022
notation: 121.2

Articles of natural cork
type: Concept
broader: Natural cork
definition: It includes corks and stoppers of all kinds made from natural cork; discs, washers and wafers of natural cork, for lining crown corks and other closures for bottles, jars, etc.
in scheme: Forest Products Classification and Definitions (FPC&D) v2022
narrower: Articles of natural cork, corks and stoppers
narrower: Other articles of natural cork
notation: 121.3

Articles of natural cork, corks and stoppers
type: Concept
broader: Articles of natural cork
definition: It includes corks and stoppers of all kinds made from natural cork.
in scheme: Forest Products Classification and Definitions (FPC&D) v2022
notation: 121.31

Other articles of natural cork
type: Concept
broader: Articles of natural cork
definition: It includes discs, washers and wafers of natural cork, for lining crown corks and other closures for bottles, jars, etc.
in scheme: Forest Products Classification and Definitions (FPC&D) v2022
notation: 121.39

Waste of natural or agglomerated cork
type: Concept
broader: Natural cork
definition: It includes i.e. shavings, waste pieces and scrap used generally for the production of crushed, granulated or powdered cork. It includes also waste turnings, of cork in the form of “cork wool”.
in scheme: Forest Products Classification and Definitions (FPC&D) v2022
notation: 121.4

Crushed, granulated or ground cork
type: Concept
broader: Natural cork
definition: Crushed, granulated or ground cork is made from virgin cork or cork waste, and mainly used in the manufacture of agglomerated cork, linoleum or lincrusta.
in scheme: Forest Products Classification and Definitions (FPC&D) v2022
notation: 121.5

Agglomerated cork and articles of agglomerated cork
type: Concept
broader: CORK
definition: Agglomerated cork is manufactured by agglomerating crushed, granulated or ground cork generally under heat and pressure either with an added binding substance or without them.
in scheme: Forest Products Classification and Definitions (FPC&D) v2022
narrower: Agglomerated cork and articles of agglomerated cork, with a binding substance
narrower: Agglomerated cork and articles of agglomerated cork, without a binding substance
notation: 122.

Agglomerated cork and articles of agglomerated cork, with a binding substance
type: Concept
broader: Agglomerated cork and articles of agglomerated cork
definition: Agglomerated cork is manufactured under heat and pressure with an added binding substance e.g. unvulcanised rubber, glue, plastics.
in scheme: Forest Products Classification and Definitions (FPC&D) v2022
narrower: Agglomerated cork and articles of agglomerated cork, with a binding substance, blocks, plates, sheets and strip; tiles of any shape; solid cylinders, including discs
narrower: Agglomerated cork and articles of agglomerated cork, with a binding substance, corks and stoppers
narrower: Agglomerated cork and articles of agglomerated cork, with a binding substance, gaskets, washers and other seals of agglomerated cork, for civil aircraft
narrower: Other agglomerated cork and articles of agglomerated cork, with a binding substance
notation: 122.1

Agglomerated cork and articles of agglomerated cork, with a binding substance, blocks, plates, sheets and strip; tiles of any shape; solid cylinders, including discs
type: Concept
broader: Agglomerated cork and articles of agglomerated cork, with a binding substance
definition: Agglomerated cork in the form of blocks, plates, sheets and strip; tiles of any shape; solid cylinders, including discs
in scheme: Forest Products Classification and Definitions (FPC&D) v2022
notation: 122.11

Agglomerated cork and articles of agglomerated cork, with a binding substance, corks and stoppers
type: Concept
broader: Agglomerated cork and articles of agglomerated cork, with a binding substance
definition: It includes corks and stoppers of all kinds made from agglomerated cork.
in scheme: Forest Products Classification and Definitions (FPC&D) v2022
notation: 122.12

Agglomerated cork and articles of agglomerated cork, with a binding substance, gaskets, washers and other seals of agglomerated cork, for civil aircraft
type: Concept
broader: Agglomerated cork and articles of agglomerated cork, with a binding substance
definition: Agglomerated cork in the form of gaskets, washers and other seals of agglomerated cork, for civil aircraft.
in scheme: Forest Products Classification and Definitions (FPC&D) v2022
notation: 122.13

Other agglomerated cork and articles of agglomerated cork, with a binding substance
type: Concept
broader: Agglomerated cork and articles of agglomerated cork, with a binding substance
definition: Other uses of agglomerated cork, e.g. building materials, moulded shapes, insulating or protecting hot water or steam piping, for the manufacture of filters, etc.
in scheme: Forest Products Classification and Definitions (FPC&D) v2022
notation: 122.19

Agglomerated cork and articles of agglomerated cork, without a binding substance
type: Concept
broader: Agglomerated cork and articles of agglomerated cork
definition: Agglomerated cork is manufactured under heat and pressure without an added binding substance, at a temperature of about 300 oC, where natural gum in the cork acts as a binder.
in scheme: Forest Products Classification and Definitions (FPC&D) v2022
narrower: Agglomerated cork and articles of agglomerated cork, without a binding substance, blocks, plates, sheets and strip; tiles of any shape; solid cylinders, including discs
narrower: Agglomerated cork and articles of agglomerated cork, without a binding substance, corks and stoppers
narrower: Agglomerated cork and articles of agglomerated cork, without a binding substance, gaskets, washers and other seals of agglomerated cork, for civil aircraft
narrower: Other agglomerated cork and articles of agglomerated cork, without a binding substance
notation: 122.2

Agglomerated cork and articles of agglomerated cork, without a binding substance, blocks, plates, sheets and strip; tiles of any shape; solid cylinders, including discs
type: Concept
broader: Agglomerated cork and articles of agglomerated cork, without a binding substance
definition: Agglomerated cork in the form of blocks, plates, sheets and strip; tiles of any shape; solid cylinders, including discs.
in scheme: Forest Products Classification and Definitions (FPC&D) v2022
notation: 122.21

Agglomerated cork and articles of agglomerated cork, without a binding substance, corks and stoppers
type: Concept
broader: Agglomerated cork and articles of agglomerated cork, without a binding substance
definition: It includes corks and stoppers of all kinds made from agglomerated cork.
in scheme: Forest Products Classification and Definitions (FPC&D) v2022
notation: 122.22

Agglomerated cork and articles of agglomerated cork, without a binding substance, gaskets, washers and other seals of agglomerated cork, for civil aircraft
type: Concept
broader: Agglomerated cork and articles of agglomerated cork, without a binding substance
definition: Agglomerated cork in the form of gaskets, washers and other seals of agglomerated cork, for civil aircraft.
in scheme: Forest Products Classification and Definitions (FPC&D) v2022
notation: 122.23

Other agglomerated cork and articles of agglomerated cork, without a binding substance
type: Concept
broader: Agglomerated cork and articles of agglomerated cork, without a binding substance
definition: Other uses of agglomerated cork, e.g. building materials, moulded shapes, insulating or protecting hot water or steam piping, for the manufacture of filters, etc.
in scheme: Forest Products Classification and Definitions (FPC&D) v2022
notation: 122.29

SECONDARY WOOD PRODUCTS
type: Concept
definition: Secondary wood products include essentially wood products and furniture. This item will consider the products resulting from further transformation of sawnwood and other wood-based material. The range of operations and process is very wide, starting with the cutting to size of components and ending with the manufacture of finished and complex products such as pieces of furniture.
in scheme: Forest Products Classification and Definitions (FPC&D) v2022
narrower: Wooden furniture
narrower: Builder's joinery and carpentry of wood
narrower: Other manufactured wood products
narrower: Wood products for domestic/decorative use
narrower: Prefabricated buildings of wood
narrower: Further processed sawnwood
narrower: Wooden wrapping and packaging material
notation: 13
top concept of: Forest Products Classification and Definitions (FPC&D) v2022

Further processed sawnwood
type: Concept
broader: SECONDARY WOOD PRODUCTS
definition: Wood sawn or chipped lengthwise (including strips and friezes for parquet flooring, not assembled) and continuously shaped (tongued, grooved, rebated, V-jointed, beaded, moulded, rounded or the like) along any of its edges or faces, whether or not planed, sanded or finger jointed. It excludes bamboo-based products and sawn or chipped wood with further treatment of edges and/or faces other than planing, or sanding.
in scheme: Forest Products Classification and Definitions (FPC&D) v2022
narrower: Further processed sawnwood, tropical non-coniferous
narrower: Other further processed sawnwood
narrower: Further processed sawnwood, coniferous
notation: 131.

Further processed sawnwood, coniferous
type: Concept
broader: Further processed sawnwood
definition: N.A.
in scheme: Forest Products Classification and Definitions (FPC&D) v2022
narrower: Further processed sawnwood, coniferous, rounded wood
narrower: Further processed sawnwood, coniferous, beaded wood
narrower: Further processed sawnwood, coniferous, boards with rounded edges or ends
narrower: Further processed sawnwood, coniferous, V-jointed wood
narrower: Further processed sawnwood, coniferous, moulded wood
narrower: Further processed sawnwood, coniferous, thermowood and torrefied sawnwood
narrower: Other coniferous further processed sawnwood
notation: 131.1

Further processed sawnwood, coniferous, boards with rounded edges or ends
type: Concept
broader: Further processed sawnwood, coniferous
definition: Wood sawn or chipped lengthwise with rounded edges or ends.
in scheme: Forest Products Classification and Definitions (FPC&D) v2022
notation: 131.11

Further processed sawnwood, coniferous, V-jointed wood
type: Concept
broader: Further processed sawnwood, coniferous
definition: It covers i.e., wood tongued and grooved with chamfered edges or ends.
in scheme: Forest Products Classification and Definitions (FPC&D) v2022
notation: 131.12

Further processed sawnwood, coniferous, beaded wood
type: Concept
broader: Further processed sawnwood, coniferous
definition: It covers wood tongued and grooved with a simple bead between the edge or end and the tongue.
in scheme: Forest Products Classification and Definitions (FPC&D) v2022
notation: 131.13

Further processed sawnwood, coniferous, moulded wood
type: Concept
broader: Further processed sawnwood, coniferous
definition: It covers strips of wood shaped to various contours, which are used for the manufacture of picture frames, decoration of walls, furniture, etc.
in scheme: Forest Products Classification and Definitions (FPC&D) v2022
notation: 131.14

Further processed sawnwood, coniferous, rounded wood
type: Concept
broader: Further processed sawnwood, coniferous
definition: It covers drawn woods, which are used in the manufacture of certain types of match splints, pegs for footwear, certain types of wooden sun blinds, toothpicks, cheese making screens, etc.
in scheme: Forest Products Classification and Definitions (FPC&D) v2022
notation: 131.15

Further processed sawnwood, coniferous, thermowood and torrefied sawnwood
type: Concept
broader: Further processed sawnwood, coniferous
definition: The manufacturing process of ThermoWood is based on the use of high temperature and steam. No chemicals are used in the treatment. The process improves dimensional stability and biological durability of wood. Another improvement is in the insulation properties of the final material, the process leads to a reduction in thermal conductivity. Due to the high treatment temperatures the resin is removed from the wood. The manufacture of torrefied sawnwood consists of heating the wood at a very high temperature (from 190 to 240°C), in a torrefaction kiln (autoclave) at controlled atmosphere and low in oxygen. The length of the process, as well as the temperature degree sustained during a determined period, depends on the torrefied specie and the desired colour. This technology requires a pre-drying process using conventional kiln driers, to lower the moisture level between 6% and 10%. After that, the torrefaction kiln lowers the moisture level to 0%. Finally, the wood is placed in a conditioning chamber where the temperature is gradually lowered by controlled steam injection. The moisture level of the product is increased between 3% and 6%, in order to give back to the wood its natural flexibility. This conditioning stabilizes the wood and allows better quality manufacturing.
in scheme: Forest Products Classification and Definitions (FPC&D) v2022
notation: 131.16

Other coniferous further processed sawnwood
type: Concept
broader: Further processed sawnwood, coniferous
definition: Other further processed sawnwood not mentioned in the previous items.
in scheme: Forest Products Classification and Definitions (FPC&D) v2022
notation: 131.19

Further processed sawnwood, tropical non-coniferous
type: Concept
broader: Further processed sawnwood
definition: N.A.
in scheme: Forest Products Classification and Definitions (FPC&D) v2022
narrower: Further processed sawnwood, tropical non-coniferous, beaded wood
narrower: Further processed sawnwood, tropical non-coniferous, moulded wood
narrower: Further processed sawnwood, tropical non-coniferous, boards with rounded edges or ends
narrower: Further processed sawnwood, tropical non-coniferous, V-jointed wood
narrower: Further processed sawnwood, tropical non-coniferous, rounded wood
narrower: Further processed sawnwood, tropical non-coniferous, thermowood and torrefied sawnwood
narrower: Other tropical non-coniferous further processed sawnwood
notation: 131.2

Further processed sawnwood, tropical non-coniferous, boards with rounded edges or ends
type: Concept
broader: Further processed sawnwood, tropical non-coniferous
definition: Wood sawn or chipped lengthwise with rounded edges or ends.
in scheme: Forest Products Classification and Definitions (FPC&D) v2022
notation: 131.21

Further processed sawnwood, tropical non-coniferous, V-jointed wood
type: Concept
broader: Further processed sawnwood, tropical non-coniferous
definition: It covers i.e., wood tongued and grooved with chamfered edges or ends.
in scheme: Forest Products Classification and Definitions (FPC&D) v2022
notation: 131.22

Further processed sawnwood, tropical non-coniferous, beaded wood
type: Concept
broader: Further processed sawnwood, tropical non-coniferous
definition: It covers wood tongued and grooved with a simple bead between the edge or end and the tongue.
in scheme: Forest Products Classification and Definitions (FPC&D) v2022
notation: 131.23

Further processed sawnwood, tropical non-coniferous, moulded wood
type: Concept
broader: Further processed sawnwood, tropical non-coniferous
definition: It covers strips of wood shaped to various contours, which are used for the manufacture of picture frames, decoration of walls, furniture, etc.
in scheme: Forest Products Classification and Definitions (FPC&D) v2022
notation: 131.24

Further processed sawnwood, tropical non-coniferous, rounded wood
type: Concept
broader: Further processed sawnwood, tropical non-coniferous
definition: It covers drawn woods, which are used in the manufacture of certain types of match splints, pegs for footwear, certain types of wooden sun blinds, toothpicks, cheese making screens, etc.
in scheme: Forest Products Classification and Definitions (FPC&D) v2022
notation: 131.25

Further processed sawnwood, tropical non-coniferous, thermowood and torrefied sawnwood
type: Concept
broader: Further processed sawnwood, tropical non-coniferous
definition: The manufacturing process of ThermoWood is based on the use of high temperature and steam. No chemicals are used in the treatment. The process improves dimensional stability and biological durability of wood. Another improvement is in the insulation properties of the final material, the process leads to a reduction in thermal conductivity. Due to the high treatment temperatures the resin is removed from the wood. The manufacture of torrefied sawnwood consists of heating the wood at a very high temperature (from 190 to 240°C), in a torrefaction kiln (autoclave) at controlled atmosphere and low in oxygen. The length of the process, as well as the temperature degree sustained during a determined period, depends on the torrefied specie and the desired colour. This technology requires a pre-drying process using conventional kiln driers, to lower the moisture level between 6% and 10%. After that, the torrefaction kiln lowers the moisture level to 0%. Finally, the wood is placed in a conditioning chamber where the temperature is gradually lowered by controlled steam injection. The moisture level of the product is increased between 3% and 6%, in order to give back to the wood its natural flexibility. This conditioning stabilizes the wood and allows better quality manufacturing.
in scheme: Forest Products Classification and Definitions (FPC&D) v2022
notation: 131.26

Other tropical non-coniferous further processed sawnwood
type: Concept
broader: Further processed sawnwood, tropical non-coniferous
definition: Other further processed sawnwood not mentioned in the previous items.
in scheme: Forest Products Classification and Definitions (FPC&D) v2022
notation: 131.29

Other further processed sawnwood
type: Concept
broader: Further processed sawnwood
definition: N.A.
in scheme: Forest Products Classification and Definitions (FPC&D) v2022
narrower: Other further processed sawnwood, boards with rounded edges or ends
narrower: Other further processed sawnwood n.e.c.
narrower: Other further processed sawnwood, V-jointed wood
narrower: Other further processed sawnwood, beaded wood
narrower: Other further processed sawnwood, moulded wood
narrower: Other further processed sawnwood, rounded wood
narrower: Other further processed sawnwood, thermowood and torrefied sawnwood
notation: 131.9

Other further processed sawnwood, boards with rounded edges or ends
type: Concept
broader: Other further processed sawnwood
definition: Wood sawn or chipped lengthwise with rounded edges or ends.
in scheme: Forest Products Classification and Definitions (FPC&D) v2022
notation: 131.91

Other further processed sawnwood, V-jointed wood
type: Concept
broader: Other further processed sawnwood
definition: It covers i.e., wood tongued and grooved with chamfered edges or ends.
in scheme: Forest Products Classification and Definitions (FPC&D) v2022
notation: 131.92

Other further processed sawnwood, beaded wood
type: Concept
broader: Other further processed sawnwood
definition: It covers wood tongued and grooved with a simple bead between the edge or end and the tongue.
in scheme: Forest Products Classification and Definitions (FPC&D) v2022
notation: 131.93

Other further processed sawnwood, moulded wood
type: Concept
broader: Other further processed sawnwood
definition: It covers strips of wood shaped to various contours, which are used for the manufacture of picture frames, decoration of walls, furniture, etc.
in scheme: Forest Products Classification and Definitions (FPC&D) v2022
notation: 131.94

Other further processed sawnwood, rounded wood
type: Concept
broader: Other further processed sawnwood
definition: It covers drawn woods, which are used in the manufacture of certain types of match splints, pegs for footwear, certain types of wooden sun blinds, toothpicks, cheese making screens, etc.
in scheme: Forest Products Classification and Definitions (FPC&D) v2022
notation: 131.95

Other further processed sawnwood, thermowood and torrefied sawnwood
type: Concept
broader: Other further processed sawnwood
definition: The manufacturing process of ThermoWood is based on the use of high temperature and steam. No chemicals are used in the treatment. The process improves dimensional stability and biological durability of wood. Another improvement is in the insulation properties of the final material, the process leads to a reduction in thermal conductivity. Due to the high treatment temperatures the resin is removed from the wood. The manufacture of torrefied sawnwood consists of heating the wood at a very high temperature (from 190 to 240°C), in a torrefaction kiln (autoclave) at controlled atmosphere and low in oxygen. The length of the process, as well as the temperature degree sustained during a determined period, depends on the torrefied specie and the desired colour. This technology requires a pre-drying process using conventional kiln driers, to lower the moisture level between 6% and 10%. After that, the torrefaction kiln lowers the moisture level to 0%. Finally, the wood is placed in a conditioning chamber where the temperature is gradually lowered by controlled steam injection. The moisture level of the product is increased between 3% and 6%, in order to give back to the wood its natural flexibility. This conditioning stabilizes the wood and allows better quality manufacturing.
in scheme: Forest Products Classification and Definitions (FPC&D) v2022
notation: 131.96

Other further processed sawnwood n.e.c.
type: Concept
broader: Other further processed sawnwood
definition: Other further processed sawnwood not mentioned in the previous items.
in scheme: Forest Products Classification and Definitions (FPC&D) v2022
notation: 131.99

Wooden wrapping and packaging material
type: Concept
broader: SECONDARY WOOD PRODUCTS
definition: It includes packing cases, boxes, crates, drums and similar packings, of wood; cable-drums of wood; pallets, box pallets and other load boards, of wood; pallet collars of wood. Casks, barrels, vats, tubs and other coopers' products and parts thereof, of wood, including staves.
in scheme: Forest Products Classification and Definitions (FPC&D) v2022
narrower: Packing cases, boxes, crates, drums and similar packings
narrower: Parts of coopers' products from wood, including staves
narrower: Other wooden wrapping and packaging material
narrower: Cable drums
narrower: Pallets, box pallets and other load boards
narrower: Pallet collars
narrower: Casks, barrels, vats, tubs and other coopers' products
notation: 132.

Packing cases, boxes, crates, drums and similar packings
type: Concept
broader: Wooden wrapping and packaging material
definition: It includes packing cases and boxes with solid sides, lids and bottoms; crates, fruit or vegetable boxes, egg trays and other containers with slatted sides and open tops; boxes made of sliced or peeled wood; match boxes and conical open containers for marketing butter, fruit, etc.
in scheme: Forest Products Classification and Definitions (FPC&D) v2022
notation: 132.1

Cable drums
type: Concept
broader: Wooden wrapping and packaging material
definition: Cable drums are large drums, used to hold and transport electric cables, telephone cables and similar cables.
in scheme: Forest Products Classification and Definitions (FPC&D) v2022
notation: 132.2

Pallets, box pallets and other load boards
type: Concept
broader: Wooden wrapping and packaging material
definition: It encompasses products which serve as a portable platforms for the assembly of a quantity of goods to form a unit load for handling, transportation and storage by mechanical appliances. It includes also platforms, post platforms, collar type box platforms, side rail platforms and end rail platforms.
in scheme: Forest Products Classification and Definitions (FPC&D) v2022
notation: 132.3

Pallet collars
type: Concept
broader: Wooden wrapping and packaging material
definition: Pallet collars are collars made up of four pieces of wood, usually with hinges on the ends to form a frame that is placed over the pallet itself.
in scheme: Forest Products Classification and Definitions (FPC&D) v2022
notation: 132.4

Casks, barrels, vats, tubs and other coopers' products
type: Concept
broader: Wooden wrapping and packaging material
definition: It includes containers which the bodies are composed of staves with grooves into which the heads and bottoms are fitted and the shape being maintained by hoops of wood or metal.
in scheme: Forest Products Classification and Definitions (FPC&D) v2022
notation: 132.5

Parts of coopers' products from wood, including staves
type: Concept
broader: Wooden wrapping and packaging material
definition: It includes barrel heads, hoopwood and unfinished staves (stavewood).
in scheme: Forest Products Classification and Definitions (FPC&D) v2022
notation: 132.6

Other wooden wrapping and packaging material
type: Concept
broader: Wooden wrapping and packaging material
definition: Other wooden wrapping and packaging material not mentioned in the groups 132.1, 132.2, 132.3, 132.4, 132.5 and 132.6
in scheme: Forest Products Classification and Definitions (FPC&D) v2022
notation: 132.9

Wood products for domestic/decorative use
type: Concept
broader: SECONDARY WOOD PRODUCTS
definition: It includes wooden frames for paintings, photographs, mirrors or similar objects; tableware and kitchenware of wood; and wood marquetry and inlaid wood, cases for jewellery or cutlery, statuettes and other ornaments of wood; hat racks. It excludes bamboo-based products.
in scheme: Forest Products Classification and Definitions (FPC&D) v2022
narrower: Tableware and kitchenware
narrower: Wooden frames for paintings, photographs, mirrors or similar objects
narrower: Wood marquetry and inlaid wood
narrower: Caskets and cases for jewellery or cutlery
narrower: Statuettes and other ornaments
narrower: Other wood products for domestic or decorative use
notation: 133.

Wooden frames for paintings, photographs, mirrors or similar objects
type: Concept
broader: Wood products for domestic/decorative use
definition: It includes wooden frames of all shapes and dimensions. The frames of the heading may also be of wood marquetry or inlaid wood.
in scheme: Forest Products Classification and Definitions (FPC&D) v2022
narrower: Wooden frames for paintings, photographs, mirrors or similar objects, tropical non-coniferous
narrower: Other Wooden frames for paintings, photographs, mirrors or similar objects
notation: 133.1

Wooden frames for paintings, photographs, mirrors or similar objects, tropical non-coniferous
type: Concept
broader: Wooden frames for paintings, photographs, mirrors or similar objects
definition: It includes wooden frames of all shapes and dimensions. The frames of the heading may also be of wood marquetry or inlaid wood.
in scheme: Forest Products Classification and Definitions (FPC&D) v2022
notation: 133.11

Other Wooden frames for paintings, photographs, mirrors or similar objects
type: Concept
broader: Wooden frames for paintings, photographs, mirrors or similar objects
definition: It includes wooden frames of all shapes and dimensions. The frames of the heading may also be of wood marquetry or inlaid wood.
in scheme: Forest Products Classification and Definitions (FPC&D) v2022
notation: 133.19

Tableware and kitchenware
type: Concept
broader: Wood products for domestic/decorative use
definition: It includes household articles of wood, which are used as tableware or kitchenware like spoons, forks, salad servers; platters and serving dishes; jars, cups and saucers; etc.
in scheme: Forest Products Classification and Definitions (FPC&D) v2022
narrower: Tableware and kitchenware, tropical non-coniferous
narrower: Other Tableware and kitchenware
notation: 133.2

Tableware and kitchenware, tropical non-coniferous
type: Concept
broader: Tableware and kitchenware
definition: It includes household articles of wood, which are used as tableware or kitchenware like spoons, forks, salad servers; platters and serving dishes; jars, cups and saucers; etc.
in scheme: Forest Products Classification and Definitions (FPC&D) v2022
notation: 133.21

Other Tableware and kitchenware
type: Concept
broader: Tableware and kitchenware
definition: It includes household articles of wood, which are used as tableware or kitchenware like spoons, forks, salad servers; platters and serving dishes; jars, cups and saucers; etc.
in scheme: Forest Products Classification and Definitions (FPC&D) v2022
notation: 133.29

Wood marquetry and inlaid wood
type: Concept
broader: Wood products for domestic/decorative use
definition: It includes panels of wood marquetry and inlaid wood, including those partly of material other than wood.
in scheme: Forest Products Classification and Definitions (FPC&D) v2022
notation: 133.3

Caskets and cases for jewellery or cutlery
type: Concept
broader: Wood products for domestic/decorative use
definition: It includes a wide variety of articles of generally of careful manufacture and good finish, such as small articles of cabinetwork (for example, caskets and jewel cases); small furnishing goods; decorative articles, etc.
in scheme: Forest Products Classification and Definitions (FPC&D) v2022
notation: 133.4

Statuettes and other ornaments
type: Concept
broader: Wood products for domestic/decorative use
definition: It includes statuettes, animals, figures and other ornaments.
in scheme: Forest Products Classification and Definitions (FPC&D) v2022
narrower: Other Statuettes and other ornaments
narrower: Statuettes and other ornaments, tropical non-coniferous
notation: 133.5

Statuettes and other ornaments, tropical non-coniferous
type: Concept
broader: Statuettes and other ornaments
definition: It includes statuettes, animals, figures and other ornaments.
in scheme: Forest Products Classification and Definitions (FPC&D) v2022
notation: 133.51

Other Statuettes and other ornaments
type: Concept
broader: Statuettes and other ornaments
definition: It includes statuettes, animals, figures and other ornaments.
in scheme: Forest Products Classification and Definitions (FPC&D) v2022
notation: 133.59

Other wood products for domestic or decorative use
type: Concept
broader: Wood products for domestic/decorative use
definition: Other wood products for domestic and decorative use not mentioned in the groups 133.1, 133.2, 133.3, 133.4 and 133.5
in scheme: Forest Products Classification and Definitions (FPC&D) v2022
notation: 133.9

Other manufactured wood products
type: Concept
broader: SECONDARY WOOD PRODUCTS
definition: It includes tools, tool handles, broom or brush bodies and handles, boot or shoe lasts or trees; clothes hangers, coffins and other articles of wood. It excludes bamboo-based products.
in scheme: Forest Products Classification and Definitions (FPC&D) v2022
narrower: Clothes hangers
narrower: Tools, tool bodies, tool handles
narrower: Broom or brush bodies and handles
narrower: Boot or shoe lasts and trees
narrower: Coffins
narrower: Other manufactured wood products n.e.c.
notation: 134.

Tools, tool bodies, tool handles
type: Concept
broader: Other manufactured wood products
definition: It includes tool bodies of not fitted with their metal working parts and wooden handles for tools or implements of all kinds (e.g., handles for spades, shovels, rakes, hammers, screwdrivers, saws, etc.)
in scheme: Forest Products Classification and Definitions (FPC&D) v2022
notation: 134.1

Broom or brush bodies and handles
type: Concept
broader: Other manufactured wood products
definition: Broom or brush bodies are pieces of wood, shaped to the actual form of broom or brush heads. They may sometimes consist of more than one piece.
in scheme: Forest Products Classification and Definitions (FPC&D) v2022
notation: 134.2

Boot or shoe lasts and trees
type: Concept
broader: Other manufactured wood products
definition: Boot or shoe lasts of wood and boot or shoe trees, which are used for preserving the shape or for stretching footwear.
in scheme: Forest Products Classification and Definitions (FPC&D) v2022
notation: 134.3

Clothes hangers
type: Concept
broader: Other manufactured wood products
definition: Wooden clothes hanger consists of a flat piece of wood cut into a boomerang-like shape with the edges sanded down to prevent damage to the clothing, and a hook, usually of metal, protruding from the point. Some wooden hangers have a rounded bar from tip to tip, forming a flattened triangle. This bar is designed to hang the trousers belonging to the jacket.
in scheme: Forest Products Classification and Definitions (FPC&D) v2022
notation: 134.4

Coffins
type: Concept
broader: Other manufactured wood products
definition: A coffin is a funerary box used for burial or cremation.
in scheme: Forest Products Classification and Definitions (FPC&D) v2022
notation: 134.5

Other manufactured wood products n.e.c.
type: Concept
broader: Other manufactured wood products
definition: It includes match splints which are manufactured to the dimensions of matches; wood paving blocks; spools, cops, bobbins, sewing thread reels; ladders and steps; clothes pegs; oars, paddles, rudders; coffins, etc.
in scheme: Forest Products Classification and Definitions (FPC&D) v2022
notation: 134.9

Builder's joinery and carpentry of wood
type: Concept
broader: SECONDARY WOOD PRODUCTS
definition: It includes windows, doors and coverings thereof as well as cellular wood panels, assembled parquet panels, shingles and shakes. It excludes bamboo-based products.
in scheme: Forest Products Classification and Definitions (FPC&D) v2022
narrower: Shingles and shakes
narrower: Assembled flooring panels
narrower: Doors and their frames and thresholds
narrower: Shuttering for concrete constructional work
narrower: Windows, French-windows and their frames
narrower: Posts and beams
narrower: Engineered structural timber products
narrower: Other builder's joinery and carpentry of wood
notation: 135.

Windows, French-windows and their frames
type: Concept
broader: Builder's joinery and carpentry of wood
definition: It includes windows, French-windows and their frames used in the construction.
in scheme: Forest Products Classification and Definitions (FPC&D) v2022
narrower: Windows, French-windows and their frames, tropical non-coniferous
narrower: Windows, French-windows and their frames, other
notation: 135.1

Windows, French-windows and their frames, tropical non-coniferous
type: Concept
broader: Windows, French-windows and their frames
definition: It includes windows, French-windows and their frames used in the construction.
in scheme: Forest Products Classification and Definitions (FPC&D) v2022
notation: 135.11

Windows, French-windows and their frames, other
type: Concept
broader: Windows, French-windows and their frames
definition: It includes windows, French-windows and their frames used in the construction.
in scheme: Forest Products Classification and Definitions (FPC&D) v2022
notation: 135.19

Doors and their frames and thresholds
type: Concept
broader: Builder's joinery and carpentry of wood
definition: Doors and their frames and thresholds used in the construction. They can be made from of ordinary wood or of particle board, fibreboard, laminated wood or densified wood.
in scheme: Forest Products Classification and Definitions (FPC&D) v2022
narrower: Doors and their frames and thresholds, tropical non-coniferous
narrower: Doors and their frames and thresholds, other
notation: 135.2

Doors and their frames and thresholds, tropical non-coniferous
type: Concept
broader: Doors and their frames and thresholds
definition: Doors and their frames and thresholds used in the construction. They can be made from of ordinary wood or of particle board, fibreboard, laminated wood or densified wood.
in scheme: Forest Products Classification and Definitions (FPC&D) v2022
notation: 135.21

Doors and their frames and thresholds, other
type: Concept
broader: Doors and their frames and thresholds
definition: Doors and their frames and thresholds used in the construction. They can be made from of ordinary wood or of particle board, fibreboard, laminated wood or densified wood.
in scheme: Forest Products Classification and Definitions (FPC&D) v2022
notation: 135.29

Shuttering for concrete constructional work
type: Concept
broader: Builder's joinery and carpentry of wood
definition: Shuttering for concrete constructional work, they can be made from of ordinary wood or of particle board, fibreboard, laminated wood or densified wood.
in scheme: Forest Products Classification and Definitions (FPC&D) v2022
notation: 135.3

Shingles and shakes
type: Concept
broader: Builder's joinery and carpentry of wood
definition: A shingle is a thin piece of wood having parallel sides and tapered so that one end is thicker than the other, sawn from a shingle bolt. It is primarily used to cover roofs and walls of buildings to protect them from the weather. A shake is a shingle obtained by splitting, instead of sawing the bolt or plank. Shakes may be straight split or hand split and resawn tapered. It is primarily used to cover roofs and walls of buildings to protect them from the weather.
in scheme: Forest Products Classification and Definitions (FPC&D) v2022
notation: 135.4

Posts and beams
type: Concept
broader: Builder's joinery and carpentry of wood
definition: Posts are round, hewn, squared or split wood, usually less than 3 m in length, but possibly up to 5 m used for fencing, guard rails and the like. Beam is a piece of wood which is typically long and squared that can be used as a building material.
in scheme: Forest Products Classification and Definitions (FPC&D) v2022
notation: 135.5

Assembled flooring panels
type: Concept
broader: Builder's joinery and carpentry of wood
definition: It includes solid blocks, strips, friezes, etc., assembled into flooring panels or tiles. It also includes flooring panels or tiles consisting of blocks, strips, friezes, etc., assembled on a support of one or more layers of wood, known as “multilayer” parquet flooring panels.
in scheme: Forest Products Classification and Definitions (FPC&D) v2022
notation: 135.6

Engineered structural timber products
type: Concept
broader: Builder's joinery and carpentry of wood
definition: Engineered structural timber products are made from sawnwood, veneers, strands of wood, or from other small wood elements that are bound together with structural resins to form structural products. They are designed for use in the same structural applications as sawnwood (e.g., girders, beams, headers, joists, studs, and columns).
in scheme: Forest Products Classification and Definitions (FPC&D) v2022
narrower: Cross - laminated timber (CLT or X-lam)
narrower: Glue‑laminated timber (GLULAM)
narrower: I-beams
narrower: Other Engineered structural timber products
notation: 135.7

Glue‑laminated timber (GLULAM)
type: Concept
broader: Engineered structural timber products
definition: Glue-laminated timber is a type of structural timber product comprising a number of layers of dimensioned timber bonded together with durable, moisture-resistant structural adhesives. The wood laminations have their grain essentially parallel.
in scheme: Forest Products Classification and Definitions (FPC&D) v2022
notation: 135.71

Cross - laminated timber (CLT or X-lam)
type: Concept
broader: Engineered structural timber products
definition: Cross-laminated timber consists of several layers of structural lumber boards stacked crosswise (typically at 90 degrees) and glued together on their wide faces and, sometimes, on the narrow faces as well. A cross-section of a CLT element has at least three glued layers of boards placed in orthogonally alternating orientation to the neighbouring layers. In special configurations, consecutive layers may be placed in the same direction, giving a double layer (e.g. double longitudinal layers at the outer faces and additional double layers at the core of the panel) to obtain specific structural capacities. CLT products are usually fabricated with three to seven layers and even more in some cases.
in scheme: Forest Products Classification and Definitions (FPC&D) v2022
notation: 135.72

I-beams
type: Concept
broader: Engineered structural timber products
definition: I-beams are strong, lightweight, "I" shaped engineered wood structural members that meet demanding performance standards. I-beams are comprised of top and bottom flanges, which resist bending, united with webs, which provide outstanding shear resistance. The flange material is typically laminated veneer lumber (LVL) or solid sawn lumber, and the web is made with plywood or OSB.
in scheme: Forest Products Classification and Definitions (FPC&D) v2022
notation: 135.73

Other Engineered structural timber products
type: Concept
broader: Engineered structural timber products
definition: Parallel strand lumber (PSL) is a form of wood product made from clipped veneer strands laid in parallel alignment and bonded with adhesive. Laminated strand lumber (LSL) resembles oriented strandboard in appearance because like OSB, LSL is made from long strands coming from fast-growing aspen or poplar. However, unlike OSB, the strands are arranged parallel to the longitudinal axis of the member. Oriented strand lumber (OSL) is made from flaked wood strands with a high length-to-thickness ratio. The strands are oriented and combined with an adhesive to form a large mat or billet and then pressed.
in scheme: Forest Products Classification and Definitions (FPC&D) v2022
notation: 135.79

Other builder's joinery and carpentry of wood
type: Concept
broader: Builder's joinery and carpentry of wood
definition: Other builder's joinery and carpentry of wood
in scheme: Forest Products Classification and Definitions (FPC&D) v2022
notation: 135.9

Wooden furniture
type: Concept
broader: SECONDARY WOOD PRODUCTS
definition: It includes seats with wooden frames, such as wooden camping and garden seats etc. and parts thereof except seats convertible into beds, swivel seats, medical seats. Wooden furniture other than seats as of a kind used in offices, in the kitchen, bedrooms and elsewhere, as well as parts of all these.
in scheme: Forest Products Classification and Definitions (FPC&D) v2022
narrower: Wood parts of the furniture
narrower: Wooden parts of seats
narrower: Wooden furniture
narrower: Other seats with wooden frames
narrower: Wood swivel seats with variable height adjustment
narrower: Wood seats other than garden seats or camping equipment, convertible into beds
notation: 136.

Wood swivel seats with variable height adjustment
type: Concept
broader: Wooden furniture
definition: Wood swivel seats with variable height adjustment
in scheme: Forest Products Classification and Definitions (FPC&D) v2022
notation: 136.1

Wood seats other than garden seats or camping equipment, convertible into beds
type: Concept
broader: Wooden furniture
definition: Wood seats other than garden seats or camping equipment, convertible into beds
in scheme: Forest Products Classification and Definitions (FPC&D) v2022
notation: 136.2

Other seats with wooden frames
type: Concept
broader: Wooden furniture
definition: It includes seats with wooden frames which can be upholstered.
in scheme: Forest Products Classification and Definitions (FPC&D) v2022
notation: 136.3

Wooden parts of seats
type: Concept
broader: Wooden furniture
definition: It includes identifiable parts of chairs or other seats, such as backs, bottoms and arm rests made from wood.
in scheme: Forest Products Classification and Definitions (FPC&D) v2022
notation: 136.4

Wooden furniture
type: Concept
broader: Wooden furniture
definition: It includes wooden furniture of a kind used in offices, in the kitchen, in the bedroom and other wooden furniture.
in scheme: Forest Products Classification and Definitions (FPC&D) v2022
narrower: Wooden furniture, used in offices
narrower: Wooden furniture, used in the kitchen
narrower: Wooden furniture, used in the bedroom
narrower: Wooden furniture n.e.c.
notation: 136.5

Wooden furniture, used in offices
type: Concept
broader: Wooden furniture
definition: It includes wooden furniture of a kind used in offices, in the kitchen, in the bedroom and other wooden furniture.
in scheme: Forest Products Classification and Definitions (FPC&D) v2022
notation: 136.51

Wooden furniture, used in the kitchen
type: Concept
broader: Wooden furniture
definition: It includes wooden furniture of a kind used in offices, in the kitchen, in the bedroom and other wooden furniture.
in scheme: Forest Products Classification and Definitions (FPC&D) v2022
notation: 136.52

Wooden furniture, used in the bedroom
type: Concept
broader: Wooden furniture
definition: It includes wooden furniture of a kind used in offices, in the kitchen, in the bedroom and other wooden furniture.
in scheme: Forest Products Classification and Definitions (FPC&D) v2022
notation: 136.53

Wooden furniture n.e.c.
type: Concept
broader: Wooden furniture
definition: It includes wooden furniture of a kind used in offices, in the kitchen, in the bedroom and other wooden furniture.
in scheme: Forest Products Classification and Definitions (FPC&D) v2022
notation: 136.59

Wood parts of the furniture
type: Concept
broader: Wooden furniture
definition: It includes identifiable parts of furniture made from wood.
in scheme: Forest Products Classification and Definitions (FPC&D) v2022
notation: 136.6

Prefabricated buildings of wood
type: Concept
broader: SECONDARY WOOD PRODUCTS
definition: It includes prefabricated buildings where the main construction material is wood.
in scheme: Forest Products Classification and Definitions (FPC&D) v2022
narrower: Prefabricated buildings, of wood, complete buildings, unassembled
narrower: Prefabricated buildings, of wood, complete buildings, fully assembled
narrower: Prefabricated buildings, of wood, incomplete buildings
notation: 137.

Prefabricated buildings, of wood, complete buildings, fully assembled
type: Concept
broader: Prefabricated buildings of wood
definition: It includes complete buildings, fully assembled and ready for use.
in scheme: Forest Products Classification and Definitions (FPC&D) v2022
notation: 137.1

Prefabricated buildings, of wood, complete buildings, unassembled
type: Concept
broader: Prefabricated buildings of wood
definition: It includes complete buildings but not assembled and ready for use.
in scheme: Forest Products Classification and Definitions (FPC&D) v2022
notation: 137.2

Prefabricated buildings, of wood, incomplete buildings
type: Concept
broader: Prefabricated buildings of wood
definition: It includes incomplete buildings, whether or not assembled and having the essential character of prefabricated buildings.
in scheme: Forest Products Classification and Definitions (FPC&D) v2022
notation: 137.3

SECONDARY PAPER PRODUCTS
type: Concept
definition: It includes all articles of paper ready for use.
in scheme: Forest Products Classification and Definitions (FPC&D) v2022
narrower: Other articles of paper and paperboard ready for use
narrower: Special coated paper and pulp products
narrower: Household and sanitary paper ready for use
narrower: Packaging cartons, boxes, etc.
narrower: Composite paper and paperboard
narrower: Carbon paper and copying paper ready for use
notation: 14
top concept of: Forest Products Classification and Definitions (FPC&D) v2022

Composite paper and paperboard
type: Concept
broader: SECONDARY PAPER PRODUCTS
definition: It includes paper and paperboard made by sticking two or more layers of paper or paperboard together with the aid of an adhesive.
in scheme: Forest Products Classification and Definitions (FPC&D) v2022
notation: 141.

Special coated paper and pulp products
type: Concept
broader: SECONDARY PAPER PRODUCTS
definition: Paper, paperboard, cellulose wadding and webs of cellulose fibres, coated, impregnated, covered, surface-coloured, surface-decorated or printed, in rolls or sheets. It includes tarred, bituminised or asphalted paper and paperboard. It excludes composite paper and paperboard (made by sticking flat layers of paper or paperboard together with an adhesive), not surface-coated or impregnated.
in scheme: Forest Products Classification and Definitions (FPC&D) v2022
narrower: Special coated paper, gummed or adhesive paper and paperboard
narrower: Other special coated paper, paperboard, cellulose wadding and webs of cellulose fibres
narrower: Special coated paper, impregnated or covered with wax, paraffin wax, stearin, oil or glycerol
narrower: Special coated paper, tarred, bituminised or asphalted paper and paperboard
notation: 142.

Special coated paper, tarred, bituminised or asphalted paper and paperboard
type: Concept
broader: Special coated paper and pulp products
definition: Tar paper is a heavy-duty paper used in construction. Tar paper is made by impregnating paper or fiberglass mat with tar, producing a waterproof material useful for roof construction. Bituminised or asphalted paper and paperboard are impregnated with bitumen (asphalt) and used in building construction.
in scheme: Forest Products Classification and Definitions (FPC&D) v2022
notation: 142.1

Special coated paper, gummed or adhesive paper and paperboard
type: Concept
broader: Special coated paper and pulp products
definition: Gummed paper is coated with a moisture activated adhesive, dextrin, gum Arabic, etc.
in scheme: Forest Products Classification and Definitions (FPC&D) v2022
narrower: Other special coated gummed or adhesive paper and paperboard
narrower: Special coated paper, gummed or adhesive paper and paperboard, self-adhesive
notation: 142.2

Special coated paper, gummed or adhesive paper and paperboard, self-adhesive
type: Concept
broader: Special coated paper, gummed or adhesive paper and paperboard
definition: Self-adhesive papers have a surface coated with an adhesive and not needing the application of glue or moisture. It is made up of three component parts: the face stock material, the adhesive and the silicone-coated release liner. The adhesive keeps the face material joined to the release liner.
in scheme: Forest Products Classification and Definitions (FPC&D) v2022
notation: 142.21

Other special coated gummed or adhesive paper and paperboard
type: Concept
broader: Special coated paper, gummed or adhesive paper and paperboard
definition: Other adhesive paper other than self-adhesive paper and other paper coated with a moisture activated adhesive, dextrin, gum Arabic, etc.
in scheme: Forest Products Classification and Definitions (FPC&D) v2022
notation: 142.29

Special coated paper, impregnated or covered with wax, paraffin wax, stearin, oil or glycerol
type: Concept
broader: Special coated paper and pulp products
definition: It includes paper and paperboard, coated, impregnated or covered with wax, paraffin wax, stearin, oil or glycerol. Application of these materials made paper moisture-proof.
in scheme: Forest Products Classification and Definitions (FPC&D) v2022
notation: 142.3

Other special coated paper, paperboard, cellulose wadding and webs of cellulose fibres
type: Concept
broader: Special coated paper and pulp products
definition: Other paper, paperboard, cellulose wadding and webs of cellulose fibre not mentioned in the groups 142.1, 142.2 and 142.3.
in scheme: Forest Products Classification and Definitions (FPC&D) v2022
notation: 142.9

Carbon paper and copying paper ready for use
type: Concept
broader: SECONDARY PAPER PRODUCTS
definition: Paper coated on one side with a layer of a loosely bound dry ink or pigmented coating, bound with wax, used for making one or more copies simultaneously with the creation of an original document by applying pressure (using a typewriter or a ballpoint pen). These products must be in strips or rolls of a width not exceeding 36 cm.
in scheme: Forest Products Classification and Definitions (FPC&D) v2022
narrower: Paper for duplicator stencils and duplicator stencils
narrower: Carbon or similar copying papers
narrower: Self-copy paper
narrower: Heat transfer papers
narrower: Paper for offset plates and offset plates
narrower: Other carbon paper and copying paper ready for use
notation: 143.

Carbon or similar copying papers
type: Concept
broader: Carbon paper and copying paper ready for use
definition: It includes papers which has been coated or sometimes impregnated with fatty or waxy substances mixed with carbon black or other colouring material. They are used for pen, pencil, or typewriter copying onto ordinary paper.
in scheme: Forest Products Classification and Definitions (FPC&D) v2022
notation: 143.1

Self-copy paper
type: Concept
broader: Carbon paper and copying paper ready for use
definition: Self-copy paper is a type of coated paper designed to transfer information written on the front onto sheets beneath. It has micro-encapsulated dye or ink on the back side of the top sheet, and a clay coating on the front side of the bottom sheet. When pressure is applied (from writing or impact printing), the dye capsules rupture and react with the clay to form a permanent mark duplicating the markings made to the top sheet.
in scheme: Forest Products Classification and Definitions (FPC&D) v2022
notation: 143.2

Heat transfer papers
type: Concept
broader: Carbon paper and copying paper ready for use
definition: It includes papers coated on one side with thermosensitive substance, for use in and infra-red copying machine.
in scheme: Forest Products Classification and Definitions (FPC&D) v2022
notation: 143.3

Paper for duplicator stencils and duplicator stencils
type: Concept
broader: Carbon paper and copying paper ready for use
definition: Paper for duplicator stencils are thin, strong, unsized papers proofed by coating or impregnating with paraffin or other wax, collodion or preparations of similar products. Pressure applied by means of a typewriter or any other appropriate instrument perforates the surface coating with the textual matter or patterns to be reproduced. Duplicator stencils are usually provided with a detachable thick paper backing attached to the top edge which is specially perforated to allow for the fixing of the prepared stencil on to the duplicator.
in scheme: Forest Products Classification and Definitions (FPC&D) v2022
notation: 143.4

Paper for offset plates and offset plates
type: Concept
broader: Carbon paper and copying paper ready for use
definition: Paper for offset plates has a special coating on one side rendering it impervious to lithographic ink. The plates are usually used on office-type offset machines.
in scheme: Forest Products Classification and Definitions (FPC&D) v2022
notation: 143.5

Other carbon paper and copying paper ready for use
type: Concept
broader: Carbon paper and copying paper ready for use
definition: It includes papers combine two or more of the reproduction processes described in the groups 143.1, 143.2, 143.3, 143.4, 143.5, and other n.e.c.
in scheme: Forest Products Classification and Definitions (FPC&D) v2022
notation: 143.9

Household and sanitary paper ready for use
type: Concept
broader: SECONDARY PAPER PRODUCTS
definition: Products ready for use: toilet paper and similar paper, cellulose wadding or webs of cellulose fibres, of a kind used for household or sanitary purposes, in rolls of a width not exceeding 36 cm, or cut to size or shape. It includes handkerchiefs, cleansing tissues, towels, tablecloths, serviettes, napkins for babies, tampons, bed sheets and similar household, sanitary or hospital articles, articles of apparel and clothing accessories, of paper pulp, paper, cellulose wadding or webs of cellulose fibres. It excludes the parent reel stock used to produce these products as well as napkins for babies and tampons.
in scheme: Forest Products Classification and Definitions (FPC&D) v2022
narrower: Toilet paper
narrower: Handkerchiefs, cleansing or facial tissues and towels
narrower: Sanitary towels and tampons, napkins and napkin liners
narrower: Articles of apparel and clothing accessories
narrower: Tablecloths and serviettes
narrower: Other household and sanitary paper ready for use
notation: 144.

Toilet paper
type: Concept
broader: Household and sanitary paper ready for use
definition: Toilet paper in strips or rolls of a width not exceeding 36 cm.
in scheme: Forest Products Classification and Definitions (FPC&D) v2022
notation: 144.1

Handkerchiefs, cleansing or facial tissues and towels
type: Concept
broader: Household and sanitary paper ready for use
definition: Handkerchiefs, cleansing or facial tissues and towels in strips or rolls of a width not exceeding 36 cm.
in scheme: Forest Products Classification and Definitions (FPC&D) v2022
notation: 144.2

Tablecloths and serviettes
type: Concept
broader: Household and sanitary paper ready for use
definition: Tablecloths and serviettes in strips or rolls of a width not exceeding 36 cm.
in scheme: Forest Products Classification and Definitions (FPC&D) v2022
notation: 144.3

Sanitary towels and tampons, napkins and napkin liners
type: Concept
broader: Household and sanitary paper ready for use
definition: Sanitary towels and tampons, napkins and napkin liners in strips or rolls of a width not exceeding 36 cm.
in scheme: Forest Products Classification and Definitions (FPC&D) v2022
notation: 144.4

Articles of apparel and clothing accessories
type: Concept
broader: Household and sanitary paper ready for use
definition: Articles of apparel and clothing accessories in strips or rolls of a width not exceeding 36 cm.
in scheme: Forest Products Classification and Definitions (FPC&D) v2022
notation: 144.5

Other household and sanitary paper ready for use
type: Concept
broader: Household and sanitary paper ready for use
definition: Other household and sanitary paper ready for use, e.g. sanitary or hospital articles, in strips or rolls of a width not exceeding 36 cm.
in scheme: Forest Products Classification and Definitions (FPC&D) v2022
notation: 144.9

Packaging cartons, boxes, etc.
type: Concept
broader: SECONDARY PAPER PRODUCTS
definition: It includes cartons, boxes, cases, bags and other packing containers, of paper, paperboard, cellulose wadding or webs of cellulose fibres; box files, letter trays, and similar articles, of paper or paperboard of a kind used in offices, shops or the like.
in scheme: Forest Products Classification and Definitions (FPC&D) v2022
narrower: Cartons, boxes and cases, of corrugated paper or paperboard
narrower: Folding cartons, boxes and cases, of non-corrugated paper or paperboard
narrower: Sacks and bags, having a base of a width of 40 cm or more
narrower: Other sacks and bags, including cones
narrower: Other packing containers, including record sleeves
narrower: Box files, letter trays, storage boxes and similar articles
notation: 145.

Cartons, boxes and cases, of corrugated paper or paperboard
type: Concept
broader: Packaging cartons, boxes, etc.
definition: It includes cartons, boxes and cases made from corrugated paper or paperboard, generally used for the packing, transport, storage or sale of merchandise.
in scheme: Forest Products Classification and Definitions (FPC&D) v2022
notation: 145.1

Folding cartons, boxes and cases, of non-corrugated paper or paperboard
type: Concept
broader: Packaging cartons, boxes, etc.
definition: It includes folding cartons, boxes and cases made from non-corrugated paper or paperboard, generally used for the packing, transport, storage or sale of merchandise.
in scheme: Forest Products Classification and Definitions (FPC&D) v2022
notation: 145.2

Sacks and bags, having a base of a width of 40 cm or more
type: Concept
broader: Packaging cartons, boxes, etc.
definition: It includes sacks and bags, having a base of a width of 40 cm or more, used for the packing, transport, storage or sale of merchandise.
in scheme: Forest Products Classification and Definitions (FPC&D) v2022
notation: 145.3

Other sacks and bags, including cones
type: Concept
broader: Packaging cartons, boxes, etc.
definition: It includes sacks and bags, including cones, used for the packing, transport, storage or sale of merchandise.
in scheme: Forest Products Classification and Definitions (FPC&D) v2022
notation: 145.4

Other packing containers, including record sleeves
type: Concept
broader: Packaging cartons, boxes, etc.
definition: It includes other packing containers, including record sleeves using as outermost cardboard covering of a record, i.e. the record jacket or album jacket.
in scheme: Forest Products Classification and Definitions (FPC&D) v2022
notation: 145.5

Box files, letter trays, storage boxes and similar articles
type: Concept
broader: Packaging cartons, boxes, etc.
definition: It includes container, such as filing cabinets, box files, letter trays, storage boxes and similar articles. They are used for the filing or storage of documents or stock of various kinds in offices, shops, warehouses, etc.
in scheme: Forest Products Classification and Definitions (FPC&D) v2022
notation: 145.6

Other articles of paper and paperboard ready for use
type: Concept
broader: SECONDARY PAPER PRODUCTS
definition: It includes products ready for use: e.g. wallpaper and similar wall coverings; window transparencies of paper; floor coverings on a base of paper or of paperboard, whether or not cut to size; all office material like for correspondence, document storage as well as albums, labels of all kinds, bobbins, spools, cops and similar supports of paper pulp, paper or paperboard (whether or not perforated or hardened); all other paper, paperboard, cellulose wadding and webs of cellulose fibres, cut to size or shape; other articles of paper pulp, paper, paperboard, cellulose wadding or webs of cellulose fibres.
in scheme: Forest Products Classification and Definitions (FPC&D) v2022
narrower: Paper and paperboard labels
narrower: Paper and paperboard stationery
narrower: Bobbins, spools, cops and similar supports of paper pulp, paper or paperboard
narrower: Other articles of paper and paperboard ready for use
narrower: Window transparencies of paper
narrower: Wallpaper and similar wall coverings
notation: 146.

Wallpaper and similar wall coverings
type: Concept
broader: Other articles of paper and paperboard ready for use
definition: It includes wallpaper and similar wall coverings in rolls of a width of not less than 45 cm and not more than 160 cm which consisting of coated or covered paper on the face side.
in scheme: Forest Products Classification and Definitions (FPC&D) v2022
notation: 146.1

Window transparencies of paper
type: Concept
broader: Other articles of paper and paperboard ready for use
definition: Window transparencies of paper are produced from thin, hard and highly-glazed translucent or transparent paper. They are used either for decorative purposes or simply to reduce the transparency of windows. They can be coated with adhesives and also printed with texts or illustrations.
in scheme: Forest Products Classification and Definitions (FPC&D) v2022
notation: 146.2

Paper and paperboard stationery
type: Concept
broader: Other articles of paper and paperboard ready for use
definition: It includes paper or paperboard stationery which are used in correspondence and other various articles of stationery like exercise books, registers, account books, etc.
in scheme: Forest Products Classification and Definitions (FPC&D) v2022
narrower: Paper and paperboard stationery, exercise books
narrower: Paper and paperboard stationery, albums for samples or for collections
narrower: Other paper and paperboard stationery
narrower: Paper and paperboard stationery, envelopes
narrower: Paper and paperboard stationery, letter cards, plain postcards and correspondence cards
narrower: Paper and paperboard stationery, boxes, pouches, wallets and writing compendium
narrower: Paper and paperboard stationery, registers, account books, note books, order books and similar
narrower: Paper and paperboard stationery, binders (other than book covers), folders and file covers
narrower: Paper and paperboard stationery, manifold business forms and interleaved carbon sets
notation: 146.3

Paper and paperboard stationery, envelopes
type: Concept
broader: Paper and paperboard stationery
definition: Envelopes can be printed with addresses, names, trademarks, decorations, crests, initials, etc.
in scheme: Forest Products Classification and Definitions (FPC&D) v2022
notation: 146.31

Paper and paperboard stationery, letter cards, plain postcards and correspondence cards
type: Concept
broader: Paper and paperboard stationery
definition: Letter cards are sheets of paper or paperboard or card with gummed edges or other provision for closing or sealing without the use of envelopes.
in scheme: Forest Products Classification and Definitions (FPC&D) v2022
notation: 146.32

Paper and paperboard stationery, boxes, pouches, wallets and writing compendium
type: Concept
broader: Paper and paperboard stationery
definition: It includes boxes, pouches, wallets and writing compendiums of paper and paperboard, containing an assortment of paper stationery.
in scheme: Forest Products Classification and Definitions (FPC&D) v2022
notation: 146.33

Paper and paperboard stationery, registers, account books, note books, order books and similar
type: Concept
broader: Paper and paperboard stationery
definition: It includes registers, account books, note books of all kinds, order books, receipt books, copy books, diaries, letter pads, memorandum pads, engagements books, address books, etc.
in scheme: Forest Products Classification and Definitions (FPC&D) v2022
notation: 146.34

Paper and paperboard stationery, exercise books
type: Concept
broader: Paper and paperboard stationery
definition: Exercise books may simply contain sheets of lined paper but may also include printed examples of handwriting for copying in manuscript.
in scheme: Forest Products Classification and Definitions (FPC&D) v2022
notation: 146.35

Paper and paperboard stationery, binders (other than book covers), folders and file covers
type: Concept
broader: Paper and paperboard stationery
definition: It includes binders designed for holding loose sheets, magazines, folders, file covers and files (other than box files) and portfolios.
in scheme: Forest Products Classification and Definitions (FPC&D) v2022
notation: 146.36

Paper and paperboard stationery, manifold business forms and interleaved carbon sets
type: Concept
broader: Paper and paperboard stationery
definition: It includes multipart form sets either printed on self-copy paper or interleaved with carbon paper. These forms are used to make multiple copies. Interleaved carbon sets are similar to manifold business forms but they either contain no printed matter or contain only identifying information such as letter heads.
in scheme: Forest Products Classification and Definitions (FPC&D) v2022
notation: 146.37

Paper and paperboard stationery, albums for samples or for collections
type: Concept
broader: Paper and paperboard stationery
definition: It includes albums for samples or for collections of stamps, photographs, etc.
in scheme: Forest Products Classification and Definitions (FPC&D) v2022
notation: 146.38

Other paper and paperboard stationery
type: Concept
broader: Paper and paperboard stationery
definition: It includes e.g. stationery bound with materials other than paper (e.g., leather, plastics or textile material) and have reinforcement of fittings of metal, plastics, etc.
in scheme: Forest Products Classification and Definitions (FPC&D) v2022
notation: 146.39

Paper and paperboard labels
type: Concept
broader: Other articles of paper and paperboard ready for use
definition: It includes all varieties of paper and paperboard labels of a kind used for attachment to any type of article for the purpose of indicating its nature, identity, ownership, destination, price, etc.
in scheme: Forest Products Classification and Definitions (FPC&D) v2022
narrower: Printed paper and paperboard labels
narrower: Other paper and paperboard labels
notation: 146.4

Printed paper and paperboard labels
type: Concept
broader: Paper and paperboard labels
definition: It includes paper and paperboard labels printed to any extent with characters or pictures.
in scheme: Forest Products Classification and Definitions (FPC&D) v2022
notation: 146.41

Other paper and paperboard labels
type: Concept
broader: Paper and paperboard labels
definition: It includes plain paper and paperboard labels.
in scheme: Forest Products Classification and Definitions (FPC&D) v2022
notation: 146.49

Bobbins, spools, cops and similar supports of paper pulp, paper or paperboard
type: Concept
broader: Other articles of paper and paperboard ready for use
definition: It includes bobbins, tubes, spools, cops, cones and similar supports for winding yarn or wire. These goods may be made of paperboard, of rolled paper sheets or of pressed or moulded pulp.
in scheme: Forest Products Classification and Definitions (FPC&D) v2022
narrower: Bobbins, spools, cops and similar supports of paper pulp, paper or paperboard, used for winding textile yarn
narrower: Other bobbins, spools, cops and similar supports of paper pulp, paper or paperboard
notation: 146.5

Bobbins, spools, cops and similar supports of paper pulp, paper or paperboard, used for winding textile yarn
type: Concept
broader: Bobbins, spools, cops and similar supports of paper pulp, paper or paperboard
definition: It includes bobbins, tubes, spools, cops, cones and similar supports used for winding textile yarn.
in scheme: Forest Products Classification and Definitions (FPC&D) v2022
notation: 146.51

Other bobbins, spools, cops and similar supports of paper pulp, paper or paperboard
type: Concept
broader: Bobbins, spools, cops and similar supports of paper pulp, paper or paperboard
definition: It includes bobbins, tubes, spools, cops, cones and similar supports used for other materials than winding textile yarn.
in scheme: Forest Products Classification and Definitions (FPC&D) v2022
notation: 146.59

Other articles of paper and paperboard ready for use
type: Concept
broader: Other articles of paper and paperboard ready for use
definition: It includes other articles of paper and paperboard ready for use not mentioned in the groups 146.1, 146.2, 146.3, 146.4 and 146.5, like filter paper and paperboard, trays, dishes, plates, etc.
in scheme: Forest Products Classification and Definitions (FPC&D) v2022
narrower: Other articles of paper and paperboard ready for use, filter paper and paperboard
narrower: Other articles of paper and paperboard ready for use, printing and writing papers ready for use
narrower: Other articles of paper and paperboard ready for use, trays, dishes, plates, cups and similar
narrower: Other articles of paper and paperboard ready for use, moulded or pressed articles of paper pulp
narrower: Other articles of paper and paperboard ready for use, rolls, sheets and dials, printed for self-recording apparatus
narrower: Other articles of paper and paperboard ready for use n.e.c.
notation: 146.9

Other articles of paper and paperboard ready for use, filter paper and paperboard
type: Concept
broader: Other articles of paper and paperboard ready for use
definition: Filter paper and paperboard are porous products, devoid of wood fibres obtained by mechanical or semi-chemical process. They are designed to remove solid particles from liquids or gases. They are produced from rag or chemical pulp or a mixture of. It includes filter paper and paperboard in strips or rolls of a width not exceeding 36 cm.
in scheme: Forest Products Classification and Definitions (FPC&D) v2022
notation: 146.91

Other articles of paper and paperboard ready for use, rolls, sheets and dials, printed for self-recording apparatus
type: Concept
broader: Other articles of paper and paperboard ready for use
definition: It includes rolls, sheets and printed dials, other than rectangular form, for self-recording apparatus.
in scheme: Forest Products Classification and Definitions (FPC&D) v2022
notation: 146.92

Other articles of paper and paperboard ready for use, trays, dishes, plates, cups and similar
type: Concept
broader: Other articles of paper and paperboard ready for use
definition: It includes trays, dishes, plates, cups and similar, of paper and paperboard.
in scheme: Forest Products Classification and Definitions (FPC&D) v2022
notation: 146.93

Other articles of paper and paperboard ready for use, moulded or pressed articles of paper pulp
type: Concept
broader: Other articles of paper and paperboard ready for use
definition: It includes e.g. articles used for protective packaging or for food service trays and beverage carriers. Other typical uses are end caps, trays, plates, bowls and clamshell containers.
in scheme: Forest Products Classification and Definitions (FPC&D) v2022
notation: 146.94

Other articles of paper and paperboard ready for use, printing and writing papers ready for use
type: Concept
broader: Other articles of paper and paperboard ready for use
definition: Paper and paperboard, of a kind used for writing, printing or other graphic purposes and cut to shape other than rectangular.
in scheme: Forest Products Classification and Definitions (FPC&D) v2022
notation: 146.95

Other articles of paper and paperboard ready for use n.e.c.
type: Concept
broader: Other articles of paper and paperboard ready for use
definition: Other articles of paper and paperboards not mentioned in the subgroups 146.91, 146.92, 146.93, 146.94 and 146.95, e.g. paper wool (narrow strips in tangled mass, used for packing), confectionery wrappers, cake cards and papers, paper lace and embroidery, paper gaskets and washers, sausages casings, etc.
in scheme: Forest Products Classification and Definitions (FPC&D) v2022
notation: 146.99

Wood briquettes, other
type: Concept
broader: Wood briquettes
definition: Agglomerates produced either directly by compression or by the addition of a binder. Briquettes are cylindrical, with a diameter exceeding 25 mm (usually from 75 mm to 90 mm) and a length up to 300 mm.
in scheme: Forest Products Classification and Definitions (FPC&D) v2022
notation: 42.9

FPC&D2022: Level 1
type: ClassificationLevel
depth: 1

FPC&D2022: Level 2
type: ClassificationLevel
depth: 2

FPC&D2022: Level 3
type: ClassificationLevel
depth: 3

FPC&D2022: Level 4
type: ClassificationLevel
depth: 4

FPC&D2022: Level 5
type: ClassificationLevel
depth: 5

FPC&D2022: Level 6
type: ClassificationLevel
depth: 6

Forest Products Classification and Definitions (FPC&D) v2022
type: ConceptScheme
creator: FAO (http://www.fao.org/)
publisher: Caliper (https://www.fao.org/statistics/caliper/)
conforms to: core#
creator: wwww.fao.org
is part of: caliper
modified: 2023-03-14
publisher: caliper
source: https://www.fao.org/3/cb8216en/cb8216en.pdf
levels: FPC&D2022: Level 1
levels: FPC&D2022: Level 2
levels: FPC&D2022: Level 3
levels: FPC&D2022: Level 4
levels: FPC&D2022: Level 5
levels: FPC&D2022: Level 6
number of levels: 6
version info: 2022
notation: FPC&D2022
media type: https://www.iana.org/assignments/media-types/application/rdf+xml